program: Orca
programVersion: 5.0.2
elementType: Cl S O O N N C C C C C C C C C C C C C C C C C C C H H H H H H H H H H H H H H H H H H H H H H H
charge: 0
multiplicity: 1
keywords: wb97x-d3
keywords: def2-TZVPP
keywords: def2/J RIJCOSX
keywords: DEFGRID2
keywords: scfconv7
keywords: smallprint printgap noloewdin
keywords: NOSOSCF
formula: C19H23ClN2O2S
InChI: InChI=1/C19H23ClN2O2S/c1-2-3-4-5-6-10-13-25-19(23)24-16-14-17(20)21-22-18(16)15-11-8-7-9-12-15/h7-9,11-12,14H,2-6,10,13H2,1H3
48 atoms
Cl -5.753216 -1.479021 -1.673896
S  0.891692 -2.671756 1.287689
O  -1.343578 -1.661404 0.770968
O  0.075524 -1.517683 -0.971494
N  -3.098501 1.108485 -0.765579
N  -4.159067 0.512174 -1.243867
C  3.661635 -0.158966 -0.1081
C  4.062395 1.296589 0.093462
C  3.728171 -0.968847 1.181602
C  3.89409 2.136797 -1.165876
C  3.640224 -2.475937 0.975421
C  4.217541 3.616427 -0.982245
C  2.378424 -2.96303 0.276215
C  5.674164 3.897329 -0.637203
C  -0.152026 -1.852493 0.147076
C  -2.288149 -0.934866 0.100531
C  -2.168285 0.449555 -0.089264
C  -1.039352 1.256263 0.409265
C  -0.492956 1.057171 1.676094
C  -0.546752 2.28781 -0.388172
C  -3.399058 -1.572971 -0.378712
C  0.526516 1.877449 2.133499
C  0.476377 3.099375 0.069271
C  1.012676 2.899252 1.333318
C  -4.320992 -0.771895 -1.043504
H  4.316139 -0.611146 -0.862764
H  2.649142 -0.195225 -0.52107
H  5.099173 1.33527 0.441997
H  3.453759 1.72663 0.895227
H  2.935494 -0.637865 1.859241
H  4.670777 -0.756798 1.695125
H  2.861026 2.039948 -1.512993
H  4.521325 1.727302 -1.96556
H  4.486358 -2.806481 0.364477
H  3.748628 -2.987893 1.93534
H  3.959253 4.150705 -1.90037
H  3.572622 4.033695 -0.201646
H  2.231433 -2.472967 -0.685333
H  2.431669 -4.036049 0.093935
H  5.868246 4.96877 -0.582232
H  6.34418 3.48085 -1.391564
H  5.956706 3.46818 0.32442
H  -0.880429 0.288773 2.331025
H  -0.976268 2.4519 -1.366769
H  -3.542901 -2.63763 -0.259634
H  0.932537 1.722991 3.124324
H  0.853126 3.895313 -0.559489
H  1.804791 3.541671 1.695147
totalener: -1856.30768753 hartree
nucrepener: 2515.68829346 hartree
electener: -4371.99598099 hartree
oneelecener: -7543.19597606 hartree
twoeener: 3171.19999508 hartree
kineticenergy: 1850.65171273 hartree
xcener: -138.239852066892 hartree
chargesum: -0.0000000
charge: -0.037844 -0.033252 -0.292743 -0.315174 -0.104381 -0.151405 -0.119679 -0.134289 -0.113962 -0.127539 -0.157786 -0.113174 -0.159583 -0.257457 0.318800 0.142033 0.204421 0.073042 -0.160846 -0.109341 -0.159310 -0.165765 -0.168256 -0.109658 0.145825 0.067946 0.064529 0.076301 0.056584 0.065974 0.072350 0.075630 0.074433 0.077417 0.087767 0.074258 0.036403 0.125493 0.123238 0.086264 0.077374 0.073250 0.133776 0.122120 0.133002 0.126677 0.134253 0.142284
qa: -0.0378 -0.0333 -0.2927 -0.3152 -0.1044 -0.1514 -0.1197 -0.1343 -0.1140 -0.1275 -0.1578 -0.1132 -0.1596 -0.2575 0.3188 0.1420 0.2044 0.0730 -0.1608 -0.1093 -0.1593 -0.1658 -0.1683 -0.1097 0.1458 0.0679 0.0645 0.0763 0.0566 0.0660 0.0723 0.0756 0.0744 0.0774 0.0878 0.0743 0.0364 0.1255 0.1232 0.0863 0.0774 0.0733 0.1338 0.1221 0.1330 0.1267 0.1343 0.1423
va: 1.2619 2.4066 2.0959 2.1768 2.9613 2.9583 3.8606 3.8652 3.8427 3.8807 3.9033 3.8935 3.9068 3.9407 4.3020 3.8880 3.8657 3.5904 3.9045 4.0303 4.0780 3.9500 3.9216 3.8592 4.1882 1.0138 1.0178 1.0122 1.0195 1.0239 1.0159 1.0118 1.0106 1.0098 1.0113 1.0072 1.0144 1.0209 1.0067 1.0066 1.0031 1.0016 1.0145 1.0275 1.0167 1.0051 0.9990 0.9896
dispcorr: -0.027217713 hartree
energy: -1856.334905243282
dipole: 70.92908 -69.30087 1.62821 22.27489 -23.21558 -0.94069 5.13318 -4.27118 0.86200
magnitude: 2.06858 au
magnitude: 5.25790 debye
