program: Orca
programVersion: 5.0.2
elementType: Cl S O O N N C C C C C C C C C C C C C C C C C C C H H H H H H H H H H H H H H H H H H H H H H H
charge: 0
multiplicity: 1
keywords: wb97x-d3
keywords: def2-TZVPP
keywords: def2/J RIJCOSX
keywords: DEFGRID2
keywords: scfconv7
keywords: smallprint printgap noloewdin
keywords: NOSOSCF
formula: C19H23ClN2O2S
InChI: InChI=1/C19H23ClN2O2S/c1-2-3-4-5-6-10-13-25-19(23)24-16-14-17(20)21-22-18(16)15-11-8-7-9-12-15/h7-9,11-12,14H,2-6,10,13H2,1H3
48 atoms
Cl -6.084082 -1.547717 -0.259658
S  1.218387 -2.317205 0.583686
O  -1.037838 -1.638735 -0.292789
O  -0.635767 -0.819382 1.765855
N  -3.366765 1.118595 -0.555555
N  -4.516411 0.500764 -0.45688
C  3.6652 1.561474 1.762294
C  4.928536 1.290088 0.948242
C  2.598405 0.470785 1.691558
C  4.681381 1.060534 -0.537147
C  3.123391 -0.906647 2.071049
C  5.959755 0.802039 -1.323602
C  2.056874 -1.986273 2.164876
C  5.7040 0.557503 -2.80343
C  -0.281323 -1.449171 0.82122
C  -2.206366 -0.932862 -0.36331
C  -2.219031 0.458717 -0.536637
C  -0.993246 1.263719 -0.688476
C  0.027686 0.869231 -1.550754
C  -0.873233 2.463931 0.006883
C  -3.39807 -1.597228 -0.277454
C  1.151195 1.664188 -1.711856
C  0.256022 3.249832 -0.148059
C  1.269026 2.853328 -1.008892
C  -4.538713 -0.804092 -0.347538
H  3.216847 2.501528 1.427894
H  3.949556 1.718708 2.807448
H  5.462283 0.428735 1.363196
H  5.610145 2.137579 1.069482
H  2.169832 0.440201 0.686621
H  1.773018 0.742278 2.354529
H  4.16635 1.9320 -0.956025
H  3.998473 0.216175 -0.680401
H  3.893062 -1.228614 1.36456
H  3.614577 -0.857334 3.049222
H  6.640393 1.650087 -1.202579
H  6.477861 -0.061245 -0.894868
H  2.497724 -2.938928 2.460076
H  1.293966 -1.735985 2.901845
H  5.052985 -0.305358 -2.954259
H  6.629926 0.368642 -3.34681
H  5.220549 1.417973 -3.269462
H  -0.059301 -0.044258 -2.123818
H  -1.669198 2.77563 0.669249
H  -3.449323 -2.668658 -0.144071
H  1.935423 1.352674 -2.389024
H  0.342662 4.178102 0.400716
H  2.148226 3.471851 -1.13332
totalener: -1856.30809183 hartree
nucrepener: 2526.26946937 hartree
electener: -4382.57756120 hartree
oneelecener: -7564.32398132 hartree
twoeener: 3181.74642012 hartree
kineticenergy: 1850.65959149 hartree
xcener: -138.242275533524 hartree
chargesum: -0.0000000
charge: -0.038532 -0.033221 -0.291902 -0.311181 -0.104411 -0.147801 -0.163310 -0.119055 -0.063092 -0.118500 -0.148782 -0.077049 -0.141153 -0.256806 0.314751 0.137358 0.193183 0.083672 -0.167627 -0.129064 -0.163929 -0.127633 -0.119441 -0.135508 0.145751 0.073913 0.081910 0.061582 0.074811 0.008926 0.094782 0.044427 0.049390 0.070517 0.079978 0.055202 0.053201 0.121384 0.115423 0.073261 0.089650 0.070583 0.127163 0.120034 0.133514 0.122235 0.126781 0.134620
qa: -0.0385 -0.0332 -0.2919 -0.3112 -0.1044 -0.1478 -0.1633 -0.1191 -0.0631 -0.1185 -0.1488 -0.0770 -0.1412 -0.2568 0.3148 0.1374 0.1932 0.0837 -0.1676 -0.1291 -0.1639 -0.1276 -0.1194 -0.1355 0.1458 0.0739 0.0819 0.0616 0.0748 0.0089 0.0948 0.0444 0.0494 0.0705 0.0800 0.0552 0.0532 0.1214 0.1154 0.0733 0.0896 0.0706 0.1272 0.1200 0.1335 0.1222 0.1268 0.1346
va: 1.2612 2.3961 2.1022 2.1794 2.9686 2.9566 3.9201 3.8837 3.8062 3.8788 3.9003 3.8933 3.9188 3.9463 4.3062 3.8808 3.8635 3.5782 3.9133 4.0393 4.0822 3.9041 3.9436 3.8884 4.1897 1.0120 1.0088 1.0045 1.0122 1.0339 1.0180 1.0156 1.0029 1.0074 1.0122 1.0091 1.0093 1.0089 1.0311 1.0028 1.0075 1.0030 1.0168 1.0252 1.0170 1.0041 1.0026 0.9953
dispcorr: -0.028060800 hartree
energy: -1856.336152626246
dipole: 74.12322 -72.20611 1.91712 16.61903 -17.41354 -0.79451 1.80469 -1.52191 0.28278
magnitude: 2.09441 au
magnitude: 5.32357 debye
