program: Orca
programVersion: 5.0.2
elementType: Cl S O O N N C C C C C C C C C C C C C C C C C C C H H H H H H H H H H H H H H H H H H H H H H H
charge: 0
multiplicity: 1
keywords: wb97x-d3
keywords: def2-TZVPP
keywords: def2/J RIJCOSX
keywords: DEFGRID2
keywords: scfconv7
keywords: smallprint printgap noloewdin
keywords: NOSOSCF
formula: C19H23ClN2O2S
InChI: InChI=1/C19H23ClN2O2S/c1-2-3-4-5-6-10-13-25-19(23)24-16-14-17(20)21-22-18(16)15-11-8-7-9-12-15/h7-9,11-12,14H,2-6,10,13H2,1H3
48 atoms
Cl -6.302715 -1.590407 -0.549398
S  0.772426 -1.845613 1.780082
O  -1.527749 -1.158861 1.019693
O  -0.362833 -2.223361 -0.589453
N  -3.265509 0.380183 -1.757904
N  -4.458159 -0.145315 -1.642878
C  4.551689 0.362348 0.014591
C  5.300901 1.414473 0.829947
C  3.650858 -0.54003 0.849143
C  4.408013 2.506621 1.411182
C  2.93351 -1.592207 0.015243
C  5.126733 3.467503 2.354611
C  2.144698 -2.590837 0.847484
C  6.254646 4.25814 1.70394
C  -0.433403 -1.790475 0.515864
C  -2.511391 -0.818555 0.136145
C  -2.293416 0.097962 -0.90427
C  -1.003022 0.772954 -1.13601
C  -0.269567 1.327679 -0.089265
C  -0.523004 0.885114 -2.438706
C  -3.756696 -1.365358 0.281694
C  0.927922 1.977639 -0.344398
C  0.677396 1.527046 -2.688449
C  1.406004 2.074908 -1.641964
C  -4.706263 -0.966702 -0.653217
H  5.279695 -0.259306 -0.515562
H  3.955072 0.852921 -0.76176
H  6.063524 1.871468 0.194164
H  5.845533 0.920686 1.642866
H  2.907768 0.058456 1.382598
H  4.255685 -1.033912 1.618754
H  3.575624 2.052047 1.956027
H  3.957935 3.075214 0.588685
H  2.274842 -1.112822 -0.713154
H  3.666472 -2.162802 -0.564989
H  4.394803 4.165296 2.769959
H  5.52001 2.904717 3.206808
H  1.739494 -3.396906 0.237008
H  2.778388 -3.047183 1.610649
H  6.684892 4.976085 2.402245
H  5.896275 4.817868 0.837865
H  7.065437 3.612628 1.365318
H  -0.638978 1.283881 0.926653
H  -1.095922 0.4623 -3.252551
H  -3.982525 -2.07538 1.064875
H  1.4855 2.414798 0.47311
H  1.043479 1.602688 -3.703626
H  2.340842 2.583814 -1.838442
totalener: -1856.30842192 hartree
nucrepener: 2482.18034410 hartree
electener: -4338.48876603 hartree
oneelecener: -7476.05288185 hartree
twoeener: 3137.56411582 hartree
kineticenergy: 1850.64954516 hartree
xcener: -138.239033316266 hartree
chargesum: 0.0000000
charge: -0.038439 -0.035782 -0.291198 -0.306560 -0.103279 -0.149980 -0.127431 -0.125961 -0.134417 -0.121051 -0.133323 -0.116137 -0.147636 -0.256693 0.312380 0.146461 0.194960 0.072542 -0.169966 -0.125076 -0.170722 -0.155993 -0.129892 -0.119679 0.146808 0.079094 0.059181 0.077186 0.059827 0.061678 0.070919 0.066721 0.053736 0.085483 0.077634 0.067116 0.055943 0.131625 0.115921 0.087404 0.075847 0.075529 0.135097 0.119934 0.133811 0.136640 0.126883 0.132855
qa: -0.0384 -0.0358 -0.2912 -0.3066 -0.1033 -0.1500 -0.1274 -0.1260 -0.1344 -0.1211 -0.1333 -0.1161 -0.1476 -0.2567 0.3124 0.1465 0.1950 0.0725 -0.1700 -0.1251 -0.1707 -0.1560 -0.1299 -0.1197 0.1468 0.0791 0.0592 0.0772 0.0598 0.0617 0.0709 0.0667 0.0537 0.0855 0.0776 0.0671 0.0559 0.1316 0.1159 0.0874 0.0758 0.0755 0.1351 0.1199 0.1338 0.1366 0.1269 0.1329
va: 1.2614 2.3941 2.1023 2.1887 2.9643 2.9571 3.8983 3.8890 3.8352 3.8863 3.8591 3.9283 3.9162 3.9367 4.3114 3.8851 3.8747 3.5756 3.9280 4.0514 4.0734 3.9178 3.9968 3.9161 4.1895 1.0136 1.0224 1.0097 1.0082 1.0203 1.0151 1.0108 1.0066 1.0156 1.0139 1.0079 1.0091 1.0238 1.0094 1.0073 1.0016 1.0015 1.0168 1.0257 1.0173 0.9998 1.0024 0.9974
dispcorr: -0.026667563 hartree
energy: -1856.335089484632
dipole: 78.67009 -76.86056 1.80953 25.68912 -26.03587 -0.34675 11.10670 -10.02117 1.08553
magnitude: 2.13846 au
magnitude: 5.43552 debye
