program: Orca
programVersion: 5.0.2
elementType: Cl S O O N N C C C C C C C C C C C C C C C C C C C H H H H H H H H H H H H H H H H H H H H H H H
charge: 0
multiplicity: 1
keywords: wb97x-d3
keywords: def2-TZVPP
keywords: def2/J RIJCOSX
keywords: DEFGRID2
keywords: scfconv7
keywords: smallprint printgap noloewdin
keywords: NOSOSCF
formula: C19H23ClN2O2S
InChI: InChI=1/C19H23ClN2O2S/c1-2-3-4-5-6-10-13-25-19(23)24-16-14-17(20)21-22-18(16)15-11-8-7-9-12-15/h7-9,11-12,14H,2-6,10,13H2,1H3
48 atoms
Cl -6.179151 -1.402094 -0.237351
S  1.105672 -2.65862 0.317544
O  -1.152913 -1.845882 -0.427229
O  -0.658827 -1.198628 1.672331
N  -3.284287 1.075338 -0.482667
N  -4.472567 0.53644 -0.37737
C  3.487654 1.195301 1.686573
C  4.430044 1.152318 0.488889
C  2.449187 0.078895 1.699772
C  5.289311 2.404777 0.370452
C  3.053597 -1.313807 1.808876
C  6.243436 2.399266 -0.820278
C  2.033576 -2.440662 1.867126
C  5.543001 2.410698 -2.173136
C  -0.35596 -1.76741 0.672572
C  -2.271116 -1.060535 -0.424219
C  -2.187741 0.335163 -0.533324
C  -0.913327 1.059597 -0.696748
C  0.043138 0.640618 -1.61961
C  -0.68569 2.217933 0.041989
C  -3.504695 -1.642207 -0.330877
C  1.205274 1.373884 -1.801368
C  0.482039 2.940667 -0.134126
C  1.428571 2.522838 -1.058437
C  -4.586396 -0.767257 -0.330298
H  2.956486 2.151776 1.682884
H  4.069799 1.178651 2.614589
H  3.834011 1.017087 -0.418501
H  5.086829 0.278438 0.549948
H  1.850353 0.153889 0.787745
H  1.757261 0.237005 2.530686
H  5.866234 2.528654 1.292211
H  4.639101 3.285125 0.306865
H  3.73913 -1.500353 0.978496
H  3.657631 -1.377619 2.720685
H  6.89896 3.271322 -0.753192
H  6.899528 1.525864 -0.755827
H  2.527711 -3.398871 2.032147
H  1.316202 -2.299862 2.675818
H  4.883918 3.276529 -2.267424
H  4.937982 1.516789 -2.329341
H  6.261491 2.459682 -2.991389
H  -0.126002 -0.239887 -2.224979
H  -1.430521 2.548397 0.752942
H  -3.629308 -2.712563 -0.246012
H  1.935925 1.048559 -2.530218
H  0.651209 3.836467 0.448416
H  2.339342 3.090685 -1.199498
totalener: -1856.30823567 hartree
nucrepener: 2519.68411614 hartree
electener: -4375.99235180 hartree
oneelecener: -7551.16393395 hartree
twoeener: 3175.17158215 hartree
kineticenergy: 1850.65641737 hartree
xcener: -138.241305732645 hartree
chargesum: 0.0000000
charge: -0.038401 -0.031800 -0.291631 -0.308514 -0.103342 -0.148282 -0.136922 -0.130097 -0.055966 -0.133332 -0.132526 -0.085238 -0.142145 -0.274451 0.306025 0.134469 0.196757 0.057893 -0.151141 -0.100586 -0.162852 -0.132380 -0.161036 -0.107379 0.146525 0.070581 0.078114 0.041307 0.071651 -0.004551 0.094624 0.072559 0.058255 0.071611 0.073504 0.069456 0.050137 0.122029 0.113048 0.074844 0.073850 0.095072 0.126074 0.118706 0.133251 0.124547 0.127006 0.130673
qa: -0.0384 -0.0318 -0.2916 -0.3085 -0.1033 -0.1483 -0.1369 -0.1301 -0.0560 -0.1333 -0.1325 -0.0852 -0.1421 -0.2745 0.3060 0.1345 0.1968 0.0579 -0.1511 -0.1006 -0.1629 -0.1324 -0.1610 -0.1074 0.1465 0.0706 0.0781 0.0413 0.0717 -0.0046 0.0946 0.0726 0.0583 0.0716 0.0735 0.0695 0.0501 0.1220 0.1130 0.0748 0.0739 0.0951 0.1261 0.1187 0.1333 0.1245 0.1270 0.1307
va: 1.2614 2.3976 2.1013 2.1820 2.9695 2.9557 3.8953 3.8416 3.8629 3.9000 3.8960 3.8822 3.9174 3.9343 4.3177 3.8887 3.8585 3.5928 3.9062 4.0121 4.0828 3.9079 3.9524 3.8675 4.1896 1.0141 1.0136 1.0157 1.0120 1.0417 1.0172 1.0141 1.0113 1.0123 1.0113 1.0088 1.0109 1.0076 1.0300 1.0023 0.9993 1.0091 1.0176 1.0249 1.0170 1.0050 1.0049 0.9943
dispcorr: -0.028408759 hartree
energy: -1856.336644425765
dipole: 74.48104 -72.58913 1.89191 22.34002 -23.23843 -0.89841 3.86743 -3.71848 0.14895
magnitude: 2.09968 au
magnitude: 5.33696 debye
