program: Orca
programVersion: 5.0.2
elementType: I I O N C C C C C C C H H H
elementType: I
charge: 0
multiplicity: 1
keywords: wb97x-d3
keywords: def2-TZVPP
keywords: def2/J RIJCOSX
keywords: DEFGRID2
keywords: scfconv7
keywords: smallprint printgap noloewdin
keywords: NOSOSCF
formula: C7H3I2NO
InChI: InChI=1/C7H3I2NO/c8-5-1-4(3-10)2-6(9)7(5)11/h1-2,11H
14 atoms
I  -3.044911 -0.625999 0.000726
I  3.036267 -0.619402 0.000754
O  0.105508 -1.653655 -0.000197
N  -0.017495 5.041624 0.00027
C  0.007738 -0.328916 -0.000367
C  -0.004168 2.465252 0.000933
C  -1.199933 0.384562 -0.000524
C  1.205618 0.400854 -0.00056
C  -1.207672 1.766552 0.000145
C  1.208723 1.778701 0.000134
C  -0.011843 3.887742 -0.000189
H  -2.142072 2.310206 -0.000528
H  2.139385 2.328774 -0.000519
H  -0.754735 -2.096376 -0.000001
elementType: I O N C H
totalener: -994.11627164 hartree
nucrepener: 838.44359558 hartree
electener: -1832.55986722 hartree
oneelecener: -3242.55317690 hartree
twoeener: 1409.99330968 hartree
cpcmener: -0.02681844 hartree
kineticenergy: 623.96278948 hartree
xcener: -68.785942452413 hartree
chargesum: 0.0000000
charge: 0.067595 0.064379 -0.338724 -0.135256 0.164939 0.184577 -0.048875 -0.049216 -0.196112 -0.187348 -0.092928 0.152836 0.148558 0.265576
qa: 0.0676 0.0644 -0.3387 -0.1353 0.1649 0.1846 -0.0489 -0.0492 -0.1961 -0.1873 -0.0929 0.1528 0.1486 0.2656
va: 1.2178 1.1952 2.2006 3.1139 3.9418 3.6548 3.9021 3.9972 3.9627 4.0061 3.9873 1.0070 1.0103 1.0021
dispcorr: -0.005773848 hartree
energy: -994.122045489244
dipole: -0.24922 -0.63459 -0.88381 97.74964 -99.98802 -2.23839 -0.03848 0.03832 -0.00015
magnitude: 2.40655 au
magnitude: 6.11697 debye
