program: Orca
programVersion: 5.0.2
elementType: Br Br O N C C C C C C C H H H
charge: 0
multiplicity: 1
keywords: wb97x-d3
keywords: def2-TZVPP
keywords: def2/J RIJCOSX
keywords: DEFGRID2
keywords: scfconv7
keywords: smallprint printgap noloewdin
keywords: NOSOSCF
formula: C7H3Br2NO
InChI: InChI=1/C7H3Br2NO/c8-5-1-4(3-10)2-6(9)7(5)11/h1-2,11H
14 atoms
Br 2.819478 0.835499 0.001796
Br -2.848356 0.805295 0.001371
O  0.081809 1.946859 0.002263
N  0.004556 -4.751944 0.010654
C  -0.004823 0.622241 0.000617
C  0.001511 -2.175515 -0.004948
C  1.195509 -0.103051 -0.000206
C  -1.200497 -0.10829 -0.000362
C  1.208956 -1.480926 -0.002868
C  -1.207295 -1.489095 -0.003002
C  0.00409 -3.598426 -0.001637
H  2.142401 -2.027241 -0.002789
H  -2.137753 -2.040664 -0.003001
H  -0.775473 2.392634 0.002342
elementType: Br O N C H
totalener: -5546.97714470 hartree
nucrepener: 1110.16838878 hartree
electener: -6657.14553348 hartree
oneelecener: -9913.45447850 hartree
twoeener: 3256.30894502 hartree
cpcmener: -0.01683902 hartree
kineticenergy: 5538.05462382 hartree
xcener: -177.848942631389 hartree
chargesum: 0.0000000
charge: -0.005173 -0.021885 -0.291022 -0.126375 0.264807 0.162594 -0.081139 -0.079438 -0.130263 -0.134947 -0.088643 0.141444 0.147504 0.242536
qa: -0.0052 -0.0219 -0.2910 -0.1264 0.2648 0.1626 -0.0811 -0.0794 -0.1303 -0.1349 -0.0886 0.1414 0.1475 0.2425
va: 1.2427 1.2484 2.2350 3.1125 3.9008 3.7025 4.0020 3.9437 3.9986 3.9561 3.9838 1.0156 1.0092 1.0234
dispcorr: -0.005486467 hartree
energy: -5546.982631169535
dipole: -0.55281 -0.17017 -0.72298 -17.14993 19.00013 1.85019 -0.01630 0.00505 -0.01125
magnitude: 1.98647 au
magnitude: 5.04919 debye
