program: Orca
programVersion: 5.0.2
elementType: S O O O N N C C C C C C C C C C H H H H H H H H H H H H
charge: 0
multiplicity: 1
keywords: wb97x-d3
keywords: def2-TZVPP
keywords: def2/J RIJCOSX
keywords: DEFGRID2
keywords: scfconv7
keywords: smallprint printgap noloewdin
keywords: NOSOSCF
formula: C10H12N2O3S
InChI: InChI=1/C10H12N2O3S/c1-7(2)12-10(13)8-5-3-4-6-9(8)11-16(12,14)15/h3-7,11H,1-2H3
28 atoms
S  -0.862476 -1.338079 -0.184052
O  -0.628259 -1.478843 -1.604513
O  -1.895897 -2.132553 0.434619
O  -0.275211 2.36584 -0.107105
N  -1.117738 0.284526 0.163325
N  0.520859 -1.547633 0.684773
C  -2.536243 0.737832 0.241071
C  -0.067876 1.173572 -0.004935
C  1.304786 0.624076 0.009667
C  1.579928 -0.695276 0.377917
C  -3.039983 1.3196 -1.070057
C  -2.766439 1.642076 1.440618
C  2.369973 1.475639 -0.291059
C  2.891603 -1.144806 0.471748
C  3.673387 1.030189 -0.211362
C  3.929965 -0.280297 0.182015
H  -3.107875 -0.167392 0.435845
H  0.745818 -2.517781 0.896933
H  -4.113158 1.491056 -0.985776
H  -2.57035 2.268859 -1.317966
H  -2.884119 0.62834 -1.898592
H  -3.841709 1.754112 1.577698
H  -2.344887 2.636205 1.317204
H  -2.364754 1.199624 2.351417
H  2.16785 2.49603 -0.585879
H  3.087747 -2.169009 0.763164
H  4.489287 1.697934 -0.449365
H  4.949356 -0.635085 0.253209
elementType: S O N C H
totalener: -1121.76600153 hartree
nucrepener: 1336.02275927 hartree
electener: -2457.78876080 hartree
oneelecener: -4188.86273450 hartree
twoeener: 1731.07397369 hartree
cpcmener: -0.03267977 hartree
kineticenergy: 1117.76985564 hartree
xcener: -87.321723880985 hartree
chargesum: -0.0000000
charge: 0.849138 -0.477341 -0.490668 -0.483810 -0.085221 -0.147350 0.039856 0.410560 -0.073707 0.057151 -0.256096 -0.275267 -0.122027 -0.172023 -0.183993 -0.087789 0.093391 0.185443 0.103578 0.093979 0.090878 0.106062 0.095149 0.101171 0.145245 0.154059 0.163396 0.166235
qa: 0.8491 -0.4773 -0.4907 -0.4838 -0.0852 -0.1474 0.0399 0.4106 -0.0737 0.0572 -0.2561 -0.2753 -0.1220 -0.1720 -0.1840 -0.0878 0.0934 0.1854 0.1036 0.0940 0.0909 0.1061 0.0951 0.1012 0.1452 0.1541 0.1634 0.1662
va: 5.9918 1.9959 2.0049 2.0152 3.1205 3.1616 3.8749 4.1068 3.6769 4.0131 3.9002 3.9020 3.9762 3.8943 3.9366 3.9006 1.0165 1.0135 1.0035 1.0166 1.0167 1.0005 1.0153 1.0073 1.0197 1.0032 0.9910 0.9862
dispcorr: -0.013735912 hartree
energy: -1121.779737441377
dipole: -5.52006 7.05294 1.53288 8.21160 -8.97383 -0.76223 2.12411 -1.01193 1.11217
magnitude: 2.04148 au
magnitude: 5.18903 debye
