program: Orca
programVersion: 5.0.2
elementType: S O O O N N C C C C C C C C C C H H H H H H H H H H H H
charge: 0
multiplicity: 1
keywords: wb97x-d3
keywords: def2-TZVPP
keywords: def2/J RIJCOSX
keywords: DEFGRID2
keywords: scfconv7
keywords: smallprint printgap noloewdin
keywords: NOSOSCF
formula: C10H12N2O3S
InChI: InChI=1/C10H12N2O3S/c1-7(2)12-10(13)8-5-3-4-6-9(8)11-16(12,14)15/h3-7,11H,1-2H3
28 atoms
S  -0.867358 -1.340787 -0.191232
O  -0.632128 -1.485311 -1.609571
O  -1.895444 -2.131948 0.438535
O  -0.275232 2.364503 -0.109048
N  -1.12041 0.283244 0.148743
N  0.518575 -1.546546 0.677276
C  -2.536701 0.736413 0.23696
C  -0.069977 1.17389 -0.011345
C  1.304145 0.622639 0.005273
C  1.578915 -0.696371 0.375718
C  -3.046416 1.32221 -1.070528
C  -2.755459 1.638874 1.440353
C  2.368961 1.475002 -0.291579
C  2.891528 -1.143647 0.474745
C  3.673062 1.031815 -0.206507
C  3.929871 -0.277901 0.188498
H  -3.10822 -0.169296 0.432906
H  0.735884 -2.512868 0.909947
H  -4.119726 1.494643 -0.984516
H  -2.576045 2.271557 -1.31812
H  -2.89327 0.632816 -1.901806
H  -3.829074 1.74551 1.597319
H  -2.340039 2.635303 1.310637
H  -2.334995 1.197541 2.344093
H  2.164383 2.495485 -0.585699
H  3.089736 -2.167441 0.767316
H  4.48923 1.700961 -0.441626
H  4.949793 -0.631533 0.263797
elementType: S O N C H
totalener: -1121.76720868 hartree
nucrepener: 1335.98150462 hartree
electener: -2457.74871330 hartree
oneelecener: -4188.70546029 hartree
twoeener: 1730.95674699 hartree
cpcmener: -0.02686636 hartree
kineticenergy: 1117.77148975 hartree
xcener: -87.320247303262 hartree
chargesum: -0.0000000
charge: 0.839667 -0.464290 -0.481881 -0.455157 -0.086005 -0.150124 0.042866 0.389060 -0.069639 0.056260 -0.257583 -0.276667 -0.120742 -0.171315 -0.180798 -0.089236 0.091679 0.179351 0.101226 0.095604 0.090806 0.104299 0.097275 0.099456 0.144824 0.148788 0.159842 0.162435
qa: 0.8397 -0.4643 -0.4819 -0.4552 -0.0860 -0.1501 0.0429 0.3891 -0.0696 0.0563 -0.2576 -0.2767 -0.1207 -0.1713 -0.1808 -0.0892 0.0917 0.1794 0.1012 0.0956 0.0908 0.1043 0.0973 0.0995 0.1448 0.1488 0.1598 0.1624
va: 6.0064 2.0120 2.0142 2.0498 3.1139 3.1595 3.8747 4.1365 3.6729 4.0154 3.8997 3.9010 3.9809 3.9026 3.9390 3.9110 1.0172 1.0175 1.0038 1.0163 1.0167 1.0009 1.0150 1.0076 1.0201 1.0048 0.9922 0.9876
dispcorr: -0.013739655 hartree
energy: -1121.780948335299
dipole: -5.49327 6.92925 1.43598 8.22972 -8.90305 -0.67332 2.18646 -1.13187 1.05460
magnitude: 1.90462 au
magnitude: 4.84116 debye
