program: Gaussian 09
title: 000059725
version: EM64L-G09RevD.01
frameworkgroup: C1[X(C13H21N3O6)]
method: RPBEPBE
basis: SDD
operation: Freq
keyword: #p
keyword: freq=noraman
keyword: PBEPBE/SDD
title: #p freq=noraman PBEPBE/SDD
converged: YES YES NO NO
title: Mulliken charges:
elementType: O O O O O O N N N C C C C C C C C C C C C C H H H H H H H H H H H H H H H H H H H H H
charge: -0.305896 -0.176137 -0.477813 -0.274776 -0.389894 -0.246531 -0.123097 -0.390218 -0.596541 -0.020568 -0.031695 -0.453665 -0.549263 -0.131898 0.146967 -0.188327 0.194060 -0.270044 -0.009071 0.148735 -0.713354 -0.728564 0.247505 0.252086 0.303562 0.232232 0.308904 0.264321 0.254332 0.294985 0.325599 0.231660 0.182189 0.376314 0.252887 0.211400 0.196562 0.226423 0.242626 0.209022 0.273648 0.304134 0.397200
chargesum: 0.00000
title: Mulliken charges with hydrogens summed into heavy atoms:
elementType: O O O O O O N N N C C C C C C C C C C C C C
charge: -0.305896 -0.176137 -0.101499 -0.274776 0.007305 -0.246531 -0.123097 -0.064619 -0.018759 0.226937 0.220391 0.082129 -0.030610 0.177006 0.146967 0.106658 0.194060 -0.038384 0.173119 0.148735 -0.052506 -0.050493
polarizability: 1.99257403e+02 4.14166550e+00 1.67318835e+02 -6.17654152e+00 -8.89282457e+00 1.60734139e+02
1716.lowfreq: -4.5350 -0.0007 -0.0007 -0.0003 1.3166 9.4561 18.1918 24.4469 32.0481
frequency: 18.1302 24.2668 32.0449 33.9210 47.9264 50.6970 60.9428 82.0766 100.1665 113.4738 116.2800 134.0244 159.7705 199.5696 212.8892 220.5587 231.7376 235.8950 243.8843 252.1776 283.6109 285.8171 310.1983 341.1749 360.2135 377.0705 397.3747 428.3350 441.1797 461.3430 487.7995 523.1512 530.0143 588.1448 594.9778 620.6175 626.5112 639.6219 657.9001 676.3572 694.8716 719.7662 735.8293 769.1761 792.4925 808.5104 810.0775 843.8741 872.9600 898.6633 913.9992 937.8344 951.2559 960.3678 962.1066 970.3546 984.8184 996.8444 1005.4638 1016.3975 1049.1565 1053.0683 1079.8451 1090.3597 1096.0880 1100.5522 1138.8302 1141.5599 1175.1172 1179.1658 1187.5029 1191.8188 1208.4395 1210.2556 1231.1302 1242.5731 1253.8507 1256.0965 1266.7465 1296.6523 1297.6883 1300.3968 1310.6754 1315.7973 1318.5599 1325.7639 1368.1736 1374.9886 1376.2964 1382.0708 1389.4248 1421.8274 1459.6794 1465.7130 1476.1130 1478.5430 1492.2685 1497.1417 1594.4178 1636.6914 1654.9202 1740.6606 2950.7121 2971.1407 2977.5620 2982.0820 3001.7530 3007.6345 3019.2856 3049.0308 3058.8866 3062.6367 3064.2839 3071.7144 3080.9697 3086.4117 3087.3940 3134.8869 3439.0545 3477.0647 3504.3549 3523.0503 3574.8971
redmass: 3.2498 6.8776 5.2717 5.0139 4.8191 7.4190 4.2257 5.0395 5.2818 5.4146 4.4852 1.4270 5.2535 3.8012 1.2758 2.4326 3.9453 2.3919 1.6455 3.5862 3.2126 2.8788 3.4382 3.5444 3.3191 2.3334 2.2511 2.2289 3.7443 3.4415 4.4221 2.4485 2.8539 3.0006 3.8307 4.4068 2.1516 2.7680 4.9786 1.2600 1.6812 2.8640 3.5633 3.7342 4.9637 5.1373 3.6193 4.0167 3.2058 2.4634 1.2615 4.4559 1.8989 3.4050 1.9092 3.4766 2.5804 3.0916 2.8639 3.6002 1.6843 2.3203 2.8124 1.9126 1.4755 2.2285 2.4500 1.7520 1.7521 2.2230 1.5629 2.1846 1.5786 1.5875 1.2692 1.3154 1.4277 1.2439 1.3845 1.5033 1.5154 1.5578 1.4376 1.4175 1.4494 1.5314 1.2311 1.3401 1.3862 1.7652 1.2409 1.1101 1.0671 1.9480 1.0656 1.0491 1.0558 1.0750 6.4921 9.3690 1.1161 12.4206 1.0804 1.0383 1.0536 1.0650 1.0849 1.0826 1.0602 1.0706 1.0793 1.0990 1.0858 1.0987 1.0998 1.1075 1.0995 1.1062 1.0474 1.0652 1.0768 1.0645 1.0945
irintensity: 1.3344 3.0282 0.0215 0.2925 2.6526 0.1089 1.2733 1.2308 0.6997 6.9453 2.5050 33.0019 1.5055 0.7928 5.4467 7.0689 4.8255 16.6387 16.7873 10.3091 15.4931 3.6486 1.6719 19.3953 15.2106 63.5507 46.1770 51.2479 19.2033 1.0204 6.0739 5.4439 21.8759 42.6436 11.4028 28.9320 59.4796 91.2913 0.9222 86.8011 216.6865 65.7085 11.6929 18.6405 5.9312 15.7327 29.4942 45.6003 18.6200 9.4672 2.2490 25.8996 2.4037 29.5446 1.7099 10.3433 29.3448 24.2901 75.4914 143.7974 17.8931 177.6346 29.7353 4.3369 16.8851 19.5608 5.3016 1.0771 3.4778 43.7435 13.2358 15.0022 23.9554 9.0835 16.2309 53.8862 32.2597 0.9376 16.9038 74.8386 32.1550 75.9256 1.7734 8.6350 10.2231 2.1533 22.0308 21.1912 6.3899 16.9863 13.2117 16.8067 19.6033 238.1079 17.3319 13.4759 12.0729 13.3962 144.2386 218.0335 29.9098 394.5503 39.3611 39.5371 48.7297 12.7509 16.9630 12.5220 26.5510 18.1088 45.2532 32.1006 3.9748 63.9859 5.9232 18.1481 36.6061 8.2544 7.7516 50.9090 46.1514 42.5567 12.5795
temp: 298.150 k
press: 1.00000 atm
elementType: 8 8 8 8 8 8 7 7 7 6 6 6 6 6 6 6 6 6 6 6 6 6 1 1 1 1 1 1 1 1 1 1 1 1 1 1 1 1 1 1 1 1 1
symmnumber: 1
zpe: 903772.3 jmol-1
zpe.correction: 0.344229 hartree
zpe.thermalcorrener: 0.367827 hartree
zpe.thermalcorrenthalpy: 0.368771 hartree
zpe.thermalcorrgfe: 0.288316 hartree
zpe.sumelectzpe: -1121.847084 hartree
zpe.sumelectthermal: -1121.823485 hartree
zpe.sumelectthermalent: -1121.822541 hartree
zpe.sumelectthermalfe: -1121.902996 hartree
dipole: 0.3699 4.2542 -2.5389
dipole: 4.9680
quadrupole: -126.0181 -138.0828 -131.9244
quadrupole: -3.6676 8.0695 18.2054
quadrupole: 5.9904 -6.0743 0.0840 -3.6676 8.0695 18.2054
hfenergy: -1122.1913122 hartree
pointgroup: C01 [X(C13H21N3O6)]
dipole: 0.2006311 -1.5747679 -1.1402528 debye
polarizability: 196.0100172|6.594389|167.0737299|9.2266537|11.0036616|164.2266297 unknown
InChI: InChI=1S/C13H21N3O6/c1-5(2)9(14)12(19)15-10(11(18)13(20)21)6-4-16-7(17)3-8(16)22-6/h5-6,8-11,15,18,20H,3-4,14H2,1-2H3
charge 0 multiplicity 1
43 atoms
O  2.767903 0.087663 -0.55881
O  2.727402 2.923506 2.373894
O  0.476516 -2.316597 -1.944821
O  -1.393904 0.494488 1.663698
O  0.853283 -3.145861 1.613165
O  -0.131654 -4.279506 -0.165615
N  2.402134 2.318305 0.027716
N  -0.916689 -0.623349 -0.317576
N  -4.138889 0.321456 1.308199
C  3.441529 1.399846 -0.519924
C  1.31722 0.363354 -0.805733
C  1.03837 1.82014 -0.255897
C  4.310465 1.63379 0.749906
C  0.527046 -0.748472 -0.079089
C  3.071666 2.417461 1.29549
C  0.990601 -2.139396 -0.58496
C  -1.791454 -0.035678 0.578157
C  -3.288316 -0.034284 0.163356
C  -3.513739 0.935795 -1.05762
C  0.497393 -3.292822 0.286657
C  -4.958176 0.778331 -1.578349
C  -3.221397 2.402124 -0.671125
H  3.846486 1.65578 -1.512728
H  1.127361 0.305754 -1.89563
H  0.438261 1.806541 0.670511
H  0.52456 2.436135 -1.012118
H  0.714174 -0.665716 1.005718
H  4.528995 0.71232 1.310155
H  5.225337 2.231155 0.614709
H  2.098539 -2.147818 -0.583712
H  -1.252727 -1.03599 -1.193673
H  -3.554031 -1.053763 -0.185311
H  -2.810549 0.631588 -1.863689
H  0.175343 -3.261719 -2.038764
H  -5.66576 0.996894 -0.75914
H  -5.154625 1.476618 -2.412687
H  -5.152826 -0.249773 -1.940535
H  -2.182474 2.543923 -0.319345
H  -3.90284 2.716401 0.139709
H  -3.384945 3.071225 -1.535512
H  -4.598763 -0.478275 1.750984
H  -3.620432 0.884379 1.99541
H  0.535205 -3.919151 2.153026
