program: Gaussian 09
title: 000006295
version: EM64L-G09RevD.01
frameworkgroup: C1[X(C18H20Cl2)]
method: RPBEPBE
basis: SDD
operation: Freq
keyword: #p
keyword: freq=noraman
keyword: PBEPBE/SDD
title: #p freq=noraman PBEPBE/SDD
converged: YES YES NO NO
title: Mulliken charges:
elementType: Cl Cl C C C C C C C C C C C C C C C C C C H H H H H H H H H H H H H H H H H H H H
charge: 0.026159 0.019182 -0.355254 0.508972 0.531720 -0.650467 -0.363180 -0.376801 -0.421505 -0.434432 0.490943 0.498723 -0.436085 -0.419013 -0.406165 -0.403983 -0.533770 -0.534295 -0.672047 -0.670761 0.264415 0.323428 0.222115 0.240941 0.227943 0.233831 0.231457 0.230723 0.231006 0.232030 0.210011 0.210036 0.209320 0.209371 0.223029 0.217193 0.221926 0.223813 0.216764 0.222706
chargesum: 0.00000
title: Mulliken charges with hydrogens summed into heavy atoms:
elementType: Cl Cl C C C C C C C C C C C C C C C C C C
charge: 0.026159 0.019182 -0.090839 0.508972 0.531720 -0.327039 -0.141065 -0.135860 -0.193562 -0.200602 0.490943 0.498723 -0.204628 -0.188289 -0.175158 -0.171953 -0.113723 -0.115604 -0.009900 -0.007478
polarizability: 2.79190436e+02 2.76666860e+00 1.93395083e+02 -1.08582486e+01 7.30466553e+00 1.71698603e+02
1716.lowfreq: -9.0356 -7.3602 -1.8416 -0.0002 0.0004 0.0023 12.9092 25.0921 35.4692
frequency: 12.4773 25.0710 35.2416 38.4392 43.2499 46.1234 53.6769 99.5288 110.2045 114.6622 188.6101 193.0565 209.0854 217.2731 230.3120 237.2741 257.6674 294.8353 334.2728 366.3960 380.1495 391.3535 402.4741 403.7587 442.2291 505.1211 507.9260 561.0412 588.0366 634.3095 637.6004 672.1689 683.0054 727.0790 746.8509 767.0200 769.2013 784.2397 786.7491 809.1581 831.8610 845.3249 847.3386 855.5280 868.7770 953.9878 955.0086 968.2264 969.0400 970.7683 971.5557 1012.3623 1012.6371 1036.8332 1044.5804 1055.9141 1061.8538 1062.6941 1126.1658 1130.5319 1180.5445 1183.2272 1190.6578 1195.3221 1202.4659 1204.6741 1219.2708 1223.6218 1240.8219 1242.4792 1249.4662 1307.7510 1311.2427 1312.9679 1326.8327 1341.6671 1382.1021 1384.8165 1387.0515 1389.8786 1411.9541 1412.7674 1471.3682 1472.1475 1473.3270 1474.2296 1488.8552 1489.8400 1503.0993 1506.9486 1582.8375 1583.2030 1620.1458 1623.9186 2978.8639 2979.7663 2986.1523 2987.3805 3018.4336 3037.0957 3038.2582 3077.8103 3078.6144 3083.2152 3084.3917 3111.0016 3112.7130 3114.6797 3116.0642 3127.4813 3133.4961 3137.9435 3139.5975 3143.8118
redmass: 2.4635 4.3229 2.9446 5.0382 5.5583 4.7948 4.0841 5.2372 4.0935 4.3366 5.5926 1.8761 2.4782 1.6920 3.7196 2.6027 2.8290 11.2359 2.3032 2.4385 3.6965 4.6571 2.8334 2.8363 4.0732 4.1869 3.8533 2.9980 2.7884 6.7960 6.7868 4.6714 6.5115 3.6337 4.0285 3.4664 3.3690 1.1738 1.1923 2.6841 1.8970 1.2573 1.2816 1.9899 3.2532 1.3643 1.3721 1.8648 2.3148 1.6449 1.4124 2.8550 3.0489 2.1095 1.4726 2.4517 2.0522 2.0579 1.3324 1.3288 1.1591 2.6059 1.1401 1.2159 1.7840 1.2924 2.4239 1.8733 1.2602 1.2661 1.7410 1.3316 1.5320 1.5187 1.2587 1.3062 4.7129 5.3122 1.1972 1.1976 2.5303 2.5802 1.0431 1.0429 1.0693 1.0719 1.0936 1.0971 2.4430 2.5229 6.6747 6.3508 6.3827 6.4420 1.0348 1.0349 1.0599 1.0599 1.0838 1.1017 1.1017 1.1001 1.1001 1.1012 1.1012 1.0868 1.0870 1.0874 1.0873 1.0896 1.0954 1.0957 1.0969 1.0966
irintensity: 0.0049 0.1992 0.0124 0.0980 0.2668 0.0678 0.0132 0.2889 0.4217 0.7394 1.2524 0.1385 0.4123 0.5461 1.0381 0.3766 0.2037 0.5400 2.2166 0.3578 1.4103 1.8897 0.3432 0.5419 4.4575 11.5096 4.4991 42.4439 34.1826 0.0199 0.1935 88.8506 80.5772 1.3785 17.5644 5.0291 1.0077 2.9610 2.4470 20.1525 25.1930 0.5912 0.8888 21.1966 16.4196 0.9377 1.3740 3.6843 10.5747 1.8509 0.3890 8.7113 1.4005 6.4804 1.4915 13.2575 25.8683 14.2651 1.2681 14.4333 8.9211 1.9364 1.8826 3.1922 2.3907 4.2136 0.2120 1.1821 0.1478 0.2637 3.6106 2.8831 2.0894 0.8644 2.1106 4.5920 1.3973 0.3739 9.1053 9.1652 4.5822 6.3656 14.4791 14.5895 1.8685 1.2858 7.5098 8.8635 46.9631 24.3789 0.1506 0.7304 2.0763 2.2465 38.3750 42.3818 41.3560 36.6709 5.1558 7.9382 8.2001 67.6665 58.6626 38.4934 39.1019 8.8867 29.4551 6.8522 24.0435 0.6663 31.6987 37.5641 1.8492 0.3887
temp: 298.150 k
press: 1.00000 atm
elementType: 17 17 6 6 6 6 6 6 6 6 6 6 6 6 6 6 6 6 6 6 1 1 1 1 1 1 1 1 1 1 1 1 1 1 1 1 1 1 1 1
symmnumber: 1
zpe: 855127.7 jmol-1
zpe.correction: 0.325701 hartree
zpe.thermalcorrener: 0.346249 hartree
zpe.thermalcorrenthalpy: 0.347193 hartree
zpe.thermalcorrgfe: 0.272047 hartree
zpe.sumelectzpe: -1616.581383 hartree
zpe.sumelectthermal: -1616.560835 hartree
zpe.sumelectthermalent: -1616.559891 hartree
zpe.sumelectthermalfe: -1616.635037 hartree
dipole: 0.1884 -3.4869 -0.1916
dipole: 3.4972
quadrupole: -122.0111 -143.3634 -123.3549
quadrupole: 0.5377 -2.5021 1.7116
quadrupole: 7.5654 -13.7869 6.2215 0.5377 -2.5021 1.7116
hfenergy: -1616.9070835 hartree
pointgroup: C01 [X(C18H20Cl2)]
dipole: -0.0363636 1.371297 -0.1064196 debye
polarizability: 279.101372|0.7602404|192.9572279|11.4948728|-8.0646779|172.2255228 unknown
InChI: InChI=1S/C18H20Cl2/c1-3-13-5-9-15(10-6-13)17(18(19)20)16-11-7-14(4-2)8-12-16/h5-12,17-18H,3-4H2,1-2H3
charge 0 multiplicity 1
40 atoms
Cl -1.208033 -3.869164 -0.223546
Cl 1.807096 -3.536228 -0.036132
C  0.014869 -1.419105 0.495926
C  -1.331455 -0.710975 0.279398
C  1.198141 -0.44379 0.339601
C  0.20223 -2.64469 -0.420524
C  -1.948757 -0.579809 -0.989719
C  1.333531 0.381102 -0.804993
C  -1.965756 -0.110243 1.394591
C  2.180859 -0.353501 1.355158
C  -3.793624 0.73826 -0.021152
C  3.420203 1.350561 0.079646
C  -3.160014 0.129991 -1.134041
C  2.430493 1.258989 -0.93264
C  -3.174038 0.602403 1.247429
C  3.27182 0.53244 1.22846
C  -5.076226 1.540754 -0.187311
C  4.624554 2.267625 -0.079398
C  -4.800066 3.042778 -0.469246
C  5.827339 1.548554 -0.74886
H  0.031564 -1.804848 1.532892
H  0.253837 -2.413525 -1.49209
H  -1.508449 -1.053239 -1.87537
H  0.566442 0.363281 -1.587491
H  -1.509202 -0.204289 2.387736
H  2.094475 -0.985333 2.247151
H  -3.626121 0.205275 -2.124464
H  2.515609 1.892386 -1.824593
H  -3.648036 1.051734 2.129039
H  4.018516 0.590712 2.030189
H  -5.675972 1.122985 -1.018535
H  -5.694219 1.454549 0.726914
H  4.347886 3.149505 -0.688429
H  4.940388 2.649179 0.910563
H  -4.226874 3.49986 0.357637
H  -5.7461 3.603079 -0.584684
H  -4.209693 3.16779 -1.395062
H  6.150571 0.679074 -0.148307
H  6.68773 2.234754 -0.854078
H  5.555484 1.178517 -1.753963
