program: Orca
programVersion: 5.0.2
elementType: P O O O O O N C C C H H H H H H H H
charge: 0
multiplicity: 1
keywords: wb97x-d3
keywords: def2-TZVPP
keywords: def2/J RIJCOSX
keywords: DEFGRID2
keywords: scfconv7
keywords: smallprint printgap noloewdin
keywords: NOSOSCF
formula: C3H8NO5P
InChI: InChI=1/C3H8NO5P/c5-3(6)1-4-2-10(7,8)9/h4-5,7-8H,1-2H2
18 atoms
P  -1.340244 0.166187 -0.152423
O  -1.327678 0.511773 1.416558
O  -2.905723 -0.005016 -0.435351
O  -0.634655 1.155736 -1.014688
O  2.808588 0.953434 -0.66618
O  1.604007 0.746207 1.198783
N  0.568053 -1.702658 0.309835
C  -0.734355 -1.533345 -0.306324
C  1.654436 -1.06962 -0.398895
C  1.986787 0.299571 0.140757
H  -0.758017 -1.795896 -1.372986
H  -1.445693 -2.189011 0.198406
H  0.752045 -2.693445 0.369537
H  1.500223 -1.004252 -1.482779
H  2.559983 -1.667696 -0.264388
H  -0.423012 0.613263 1.757523
H  -3.329924 0.774775 -0.821429
H  3.051365 1.80937 -0.279651
elementType: P O N C H
totalener: -891.61117893 hartree
nucrepener: 721.87561076 hartree
electener: -1613.48678968 hartree
oneelecener: -2662.13168401 hartree
twoeener: 1048.64489432 hartree
cpcmener: -0.05123161 hartree
kineticenergy: 888.57462630 hartree
xcener: -65.599051434827 hartree
chargesum: -0.0000000
charge: 0.880707 -0.413824 -0.413790 -0.670331 -0.305731 -0.482236 -0.294329 -0.130269 -0.060938 0.406924 0.120984 0.135248 0.148553 0.117742 0.138220 0.276779 0.274247 0.272046
qa: 0.8807 -0.4138 -0.4138 -0.6703 -0.3057 -0.4822 -0.2943 -0.1303 -0.0609 0.4069 0.1210 0.1352 0.1486 0.1177 0.1382 0.2768 0.2742 0.2720
va: 5.2408 2.0744 2.1458 1.8852 2.1876 1.9855 2.9346 3.9078 3.8891 4.1269 1.0100 1.0115 1.0117 1.0169 1.0011 1.0089 0.9846 0.9818
dispcorr: -0.007352222 hartree
energy: -891.618531147976
dipole: 3.14152 -2.61358 0.52795 -5.92896 4.26434 -1.66462 -1.59029 0.95052 -0.63977
magnitude: 1.85984 au
magnitude: 4.72733 debye
