program: Orca
programVersion: 5.0.2
elementType: P O O O O O N C C C H H H H H H H H
charge: 0
multiplicity: 1
keywords: wb97x-d3
keywords: def2-TZVPP
keywords: def2/J RIJCOSX
keywords: DEFGRID2
keywords: scfconv7
keywords: smallprint printgap noloewdin
keywords: NOSOSCF
formula: C3H8NO5P
InChI: InChI=1/C3H8NO5P/c5-3(6)1-4-2-10(7,8)9/h4-5,7-8H,1-2H2
18 atoms
P  -1.357834 0.187291 -0.126182
O  -1.326309 0.603692 1.427648
O  -2.93163 0.105348 -0.41981
O  -0.709512 1.146215 -1.06229
O  2.810124 0.979772 -0.689201
O  1.557373 0.769037 1.144088
N  0.620506 -1.776045 0.247923
C  -0.725003 -1.521617 -0.220226
C  1.679248 -1.065655 -0.420169
C  1.974802 0.322637 0.097661
H  -0.811644 -1.828954 -1.265091
H  -1.411984 -2.158599 0.340762
H  0.6810 -1.656544 1.250926
H  1.480303 -1.02418 -1.492031
H  2.616808 -1.622806 -0.317273
H  -0.419015 0.681287 1.767876
H  -3.441109 -0.458647 0.179465
H  3.030765 1.843725 -0.306027
elementType: P O N C H
totalener: -891.61328575 hartree
nucrepener: 720.48429975 hartree
electener: -1612.09758550 hartree
oneelecener: -2658.68175197 hartree
twoeener: 1046.58416647 hartree
cpcmener: -0.05527794 hartree
kineticenergy: 888.55948705 hartree
xcener: -65.596151199132 hartree
chargesum: -0.0000000
charge: 0.878491 -0.418075 -0.415318 -0.678256 -0.303343 -0.487165 -0.319392 -0.113495 -0.035262 0.411167 0.118232 0.132962 0.148780 0.120028 0.133843 0.279388 0.275259 0.272156
qa: 0.8785 -0.4181 -0.4153 -0.6783 -0.3033 -0.4872 -0.3194 -0.1135 -0.0353 0.4112 0.1182 0.1330 0.1488 0.1200 0.1338 0.2794 0.2753 0.2722
va: 5.2120 2.0748 2.1248 1.8855 2.1947 1.9809 2.9836 3.9053 3.8843 4.1249 1.0067 1.0043 1.0243 1.0136 1.0024 1.0050 0.9792 0.9813
dispcorr: -0.007562021 hartree
energy: -891.620847769221
dipole: 3.06548 -2.55770 0.50778 -6.16596 4.17962 -1.98634 0.28419 0.74548 1.02967
magnitude: 2.29425 au
magnitude: 5.83153 debye
