program: Orca
programVersion: 5.0.2
elementType: S O O O O O N N N C C C C C C C C C C C C C C C C H H H H H H H H H H H H H H H H H
charge: 0
multiplicity: 1
keywords: wb97x-d3
keywords: def2-TZVPP
keywords: def2/J RIJCOSX
keywords: DEFGRID2
keywords: scfconv7
keywords: smallprint printgap noloewdin
keywords: NOSOSCF
formula: C16H17N3O5S
InChI: InChI=1/C16H17N3O5S/c1-9-10(15(20)11-8-17-19(2)16(11)21)4-5-13(25(3,22)23)14(9)12-6-7-24-18-12/h4-5,8,21H,6-7H2,1-3H3
42 atoms
S  3.438647 -1.568947 0.53133
O  3.71044 2.455962 -1.210687
O  3.484841 -2.952946 0.995752
O  3.876992 -1.284588 -0.8330
O  -2.723822 0.368488 2.359884
O  -5.31385 0.76607 1.1741
N  3.030717 1.79293 -0.231391
N  -5.060914 0.228693 -1.059573
N  -4.11244 -0.180899 -1.938991
C  1.30289 0.169527 0.109444
C  1.754885 -0.995492 0.730007
C  -0.034128 0.559755 0.262652
C  2.189264 0.9927 -0.739113
C  -0.881266 -0.251481 1.022892
C  2.14785 1.021931 -2.235368
C  0.911969 -1.777638 1.502776
C  -0.408378 -1.39638 1.648373
C  3.329816 1.942933 -2.506191
C  -0.528135 1.837713 -0.353377
C  -2.322737 0.096607 1.23229
C  -3.204784 0.056894 0.106842
C  4.386532 -0.59044 1.6664
C  -4.564969 0.378525 0.165202
C  -3.008559 -0.283996 -1.252953
C  -6.410643 0.447644 -1.517202
H  2.268895 0.026529 -2.660745
H  1.195559 1.419187 -2.593447
H  1.267032 -2.676906 1.985783
H  -1.075915 -2.006779 2.242842
H  4.180427 1.40966 -2.934418
H  3.082487 2.787573 -3.148362
H  -0.895888 1.682023 -1.368775
H  -1.341411 2.275998 0.222531
H  0.260005 2.58753 -0.401726
H  4.304451 0.463494 1.41221
H  4.027439 -0.766349 2.678746
H  5.424022 -0.916631 1.581809
H  -2.096258 -0.60962 -1.730528
H  -6.802836 -0.46378 -1.964068
H  -6.430719 1.246987 -2.255991
H  -7.044351 0.728322 -0.681165
H  -4.765029 0.783654 1.977737
elementType: S O N C H
totalener: -1558.57808524 hartree
nucrepener: 2425.65425070 hartree
electener: -3984.23233593 hartree
oneelecener: -6953.83808290 hartree
twoeener: 2969.60574697 hartree
cpcmener: -0.04418156 hartree
kineticenergy: 1552.93538200 hartree
xcener: -127.944470687897 hartree
chargesum: 0.0000000
charge: 0.865473 -0.266555 -0.552901 -0.541928 -0.483745 -0.333815 -0.113374 0.083613 -0.323864 0.200239 -0.118046 -0.157844 -0.073785 0.188304 -0.078466 -0.061485 -0.198144 0.030959 -0.333961 0.408933 -0.271517 -0.260912 0.315501 -0.050974 -0.156286 0.099744 0.105585 0.152277 0.148303 0.092498 0.099349 0.122111 0.119478 0.129145 0.150116 0.137721 0.137007 0.161831 0.122942 0.123222 0.112607 0.270646
qa: 0.8655 -0.2666 -0.5529 -0.5419 -0.4837 -0.3338 -0.1134 0.0836 -0.3239 0.2002 -0.1180 -0.1578 -0.0738 0.1883 -0.0785 -0.0615 -0.1981 0.0310 -0.3340 0.4089 -0.2715 -0.2609 0.3155 -0.0510 -0.1563 0.0997 0.1056 0.1523 0.1483 0.0925 0.0993 0.1221 0.1195 0.1291 0.1501 0.1377 0.1370 0.1618 0.1229 0.1232 0.1126 0.2706
va: 5.5220 1.9424 1.9267 1.9065 2.0051 2.1817 2.8591 3.3332 2.8767 3.5234 3.8145 3.7984 3.9061 3.4864 3.9234 3.9062 4.0639 3.9630 3.9515 3.8332 3.4553 3.8533 4.1482 4.1243 3.8890 1.0205 1.0075 1.0186 1.0056 0.9961 0.9935 0.9879 0.9991 1.0001 1.0174 1.0079 1.0139 0.9989 0.9941 0.9925 1.0061 1.0141
dispcorr: -0.023647750 hartree
energy: -1558.601732984924
dipole: -4.43803 1.93420 -2.50383 7.53750 -6.39818 1.13933 -7.24895 6.74824 -0.50071
magnitude: 2.79606 au
magnitude: 7.10702 debye
