program: Orca
programVersion: 5.0.2
elementType: S O O O O O N N N C C C C C C C C C C C C C C C C H H H H H H H H H H H H H H H H H
charge: 0
multiplicity: 1
keywords: wb97x-d3
keywords: def2-TZVPP
keywords: def2/J RIJCOSX
keywords: DEFGRID2
keywords: scfconv7
keywords: smallprint printgap noloewdin
keywords: NOSOSCF
formula: C16H17N3O5S
InChI: InChI=1/C16H17N3O5S/c1-9-10(15(20)11-8-17-19(2)16(11)21)4-5-13(25(3,22)23)14(9)12-6-7-24-18-12/h4-5,8,21H,6-7H2,1-3H3
42 atoms
S  3.259213 -1.767005 0.231346
O  4.129442 2.226566 -1.391387
O  4.244096 -0.82256 0.753283
O  3.158665 -3.079653 0.864576
O  -2.464857 1.596386 1.341884
O  -5.206354 1.353169 0.868315
N  3.112748 1.316251 -1.379674
N  -5.468393 -0.429352 -0.584536
N  -4.730564 -1.360707 -1.239911
C  1.453709 0.349894 0.055835
C  1.636033 -1.013621 0.297121
C  0.169331 0.902743 0.129211
C  2.597923 1.242636 -0.224348
C  -0.900933 0.059705 0.460763
C  3.20758 2.173732 0.77674
C  0.572382 -1.839625 0.612978
C  -0.695609 -1.293413 0.694659
C  4.354888 2.730178 -0.056095
C  -0.044109 2.360427 -0.164129
C  -2.280289 0.605582 0.63768
C  -3.378577 -0.044115 -0.012356
C  3.549559 -2.019084 -1.50084
C  -4.70549 0.371561 0.152071
C  -3.489751 -1.13472 -0.909328
C  -6.902618 -0.421892 -0.730187
H  2.488785 2.932993 1.093123
H  3.536853 1.642666 1.668978
H  0.715629 -2.894136 0.801391
H  -1.52532 -1.932717 0.966273
H  4.368333 3.818827 -0.099502
H  5.328165 2.378207 0.290317
H  -0.081386 2.951671 0.751105
H  0.751761 2.764084 -0.786083
H  -0.976673 2.529697 -0.699868
H  3.535135 -1.064815 -2.022531
H  4.530439 -2.485471 -1.602238
H  2.783658 -2.681437 -1.900374
H  -2.698693 -1.743419 -1.320596
H  -7.328077 -1.333802 -0.31485
H  -7.166002 -0.349953 -1.783404
H  -7.322765 0.431612 -0.20618
H  -4.460635 1.813168 1.299459
elementType: S O N C H
totalener: -1558.57939282 hartree
nucrepener: 2406.76116708 hartree
electener: -3965.34055990 hartree
oneelecener: -6916.23913431 hartree
twoeener: 2950.89857440 hartree
cpcmener: -0.04222075 hartree
kineticenergy: 1552.92777274 hartree
xcener: -127.944366839361 hartree
chargesum: 0.0000000
charge: 0.863720 -0.267050 -0.539876 -0.551819 -0.490998 -0.338304 -0.112500 0.083601 -0.324768 0.180164 -0.111252 -0.038250 -0.065975 0.118253 -0.078957 -0.034291 -0.270981 0.031037 -0.331900 0.387268 -0.230421 -0.259689 0.305381 -0.047568 -0.155933 0.106245 0.099726 0.152795 0.166787 0.099239 0.092559 0.118815 0.116836 0.113546 0.148783 0.137329 0.138131 0.159899 0.123223 0.122440 0.112814 0.271943
qa: 0.8637 -0.2671 -0.5399 -0.5518 -0.4910 -0.3383 -0.1125 0.0836 -0.3248 0.1802 -0.1113 -0.0382 -0.0660 0.1183 -0.0790 -0.0343 -0.2710 0.0310 -0.3319 0.3873 -0.2304 -0.2597 0.3054 -0.0476 -0.1559 0.1062 0.0997 0.1528 0.1668 0.0992 0.0926 0.1188 0.1168 0.1135 0.1488 0.1373 0.1381 0.1599 0.1232 0.1224 0.1128 0.2719
va: 5.5206 1.9399 1.9082 1.9276 2.0023 2.1765 2.8598 3.3315 2.8780 3.5490 3.8219 3.7697 3.9228 3.5129 3.9261 3.9030 4.0198 3.9595 3.9449 3.8120 3.4616 3.8520 4.1545 4.1382 3.8895 1.0070 1.0218 1.0186 0.9908 0.9942 0.9962 0.9996 0.9998 1.0005 1.0183 1.0136 1.0078 0.9988 0.9922 0.9948 1.0057 1.0193
dispcorr: -0.022898915 hartree
energy: -1558.602291738176
dipole: -3.60550 1.21408 -2.39142 6.41151 -5.52183 0.88969 -3.62601 3.30628 -0.31974
magnitude: 2.57151 au
magnitude: 6.53626 debye
