program: Orca
programVersion: 5.0.2
elementType: S O O O O O O O O O N N C C C C C C C C C C C C C C C C C C C C C H H H H H H H H H H H H H H H H H H H H H H H H H H H H
charge: 0
multiplicity: 1
keywords: wb97x-d3
keywords: def2-TZVPP
keywords: def2/J RIJCOSX
keywords: DEFGRID2
keywords: scfconv7
keywords: smallprint printgap noloewdin
keywords: NOSOSCF
formula: C21H28N2O9S
InChI: InChI=1/C21H28N2O9S/c1-7-23-20(31-14(3)32-21(25)29-5)16(12-22-23)18(24)15-8-9-17(33(6,26)27)19(13(15)2)30-11-10-28-4/h8-9,12,14H,7,10-11H2,1-6H3
61 atoms
S  5.145444 -0.158591 1.222202
O  3.335461 0.182187 -1.104119
O  -3.935694 0.807998 1.313869
O  5.598132 -0.231876 2.612363
O  5.407498 -1.323438 0.377748
O  -1.155654 2.168714 1.624661
O  -4.806351 1.033536 -0.803738
O  3.058509 0.208125 -3.904534
O  -5.115141 -0.222658 -2.501612
O  -3.00363 0.119302 -1.817318
N  -3.377102 -1.444804 1.247818
N  -2.31059 -2.265102 1.275374
C  1.305944 0.587963 0.103976
C  0.708969 0.736877 1.356494
C  3.399424 0.196323 1.257558
C  2.673371 0.297167 0.070206
C  -1.626376 -0.118615 1.327028
C  -0.760447 1.028061 1.445407
C  1.434026 0.633611 2.534999
C  2.790365 0.370455 2.490398
C  -3.018128 -0.160849 1.28367
C  0.506819 0.748896 -1.156721
C  -4.72396 -1.991222 1.282709
C  -1.261823 -1.482287 1.304986
C  5.886959 1.276802 0.488517
C  3.107245 -1.011385 -1.864113
C  -4.027476 1.676076 0.193831
C  -5.244235 -2.146813 2.697559
C  3.723976 -0.827364 -3.221363
C  -4.752488 2.915259 0.630884
C  3.598901 0.443428 -5.183553
C  -4.191449 0.287647 -1.721307
C  -4.661592 -1.072571 -3.562058
H  0.941595 0.758227 3.490338
H  3.356382 0.299147 3.40798
H  0.008371 -0.181962 -1.43389
H  -0.262646 1.511856 -1.045732
H  1.131372 1.049307 -1.99487
H  -5.373616 -1.343967 0.69705
H  -4.681314 -2.95084 0.772712
H  -0.267653 -1.902487 1.325504
H  6.966418 1.12437 0.506242
H  5.548968 1.395133 -0.536914
H  5.629419 2.153757 1.078703
H  3.572045 -1.865993 -1.369178
H  2.038147 -1.218568 -1.953538
H  -3.036426 1.908869 -0.197554
H  -6.243163 -2.58038 2.670537
H  -5.309414 -1.185293 3.205708
H  -4.606152 -2.806792 3.284353
H  3.638487 -1.780562 -3.759687
H  4.796403 -0.610254 -3.123635
H  -4.87154 3.589866 -0.215001
H  -5.736611 2.684982 1.038955
H  -4.166616 3.429682 1.390976
H  3.039032 1.259191 -5.639035
H  3.518305 -0.436212 -5.832112
H  4.654384 0.733224 -5.135784
H  -5.557014 -1.395744 -4.083483
H  -4.137488 -1.94304 -3.169861
H  -4.016536 -0.531223 -4.252494
elementType: S O N C H
totalener: -2001.98639256 hartree
nucrepener: 3861.47001182 hartree
electener: -5863.45640438 hartree
twoeener: 4561.89545013 hartree
cpcmener: -0.06627695 hartree
kineticenergy: 1994.41826995 hartree
xcener: -168.585045238051 hartree
chargesum: -0.0000000
charge: 0.879059 -0.387030 -0.334814 -0.576537 -0.564035 -0.467708 -0.290100 -0.379594 -0.293861 -0.476151 0.160547 -0.334050 -0.052029 0.053877 -0.109942 0.229819 -0.139567 0.428300 -0.148643 -0.111358 0.174154 -0.310243 -0.033206 -0.057975 -0.255868 -0.010094 0.232465 -0.249016 0.038798 -0.254975 -0.111125 0.595426 -0.120778 0.150642 0.157347 0.120168 0.116465 0.115769 0.099956 0.109096 0.157396 0.140182 0.140204 0.143119 0.117790 0.124081 0.138798 0.098946 0.090622 0.089385 0.092871 0.085488 0.101206 0.105774 0.099470 0.113232 0.093276 0.094521 0.132522 0.123635 0.124295
qa: 0.8791 -0.3870 -0.3348 -0.5765 -0.5640 -0.4677 -0.2901 -0.3796 -0.2939 -0.4762 0.1605 -0.3340 -0.0520 0.0539 -0.1099 0.2298 -0.1396 0.4283 -0.1486 -0.1114 0.1742 -0.3102 -0.0332 -0.0580 -0.2559 -0.0101 0.2325 -0.2490 0.0388 -0.2550 -0.1111 0.5954 -0.1208 0.1506 0.1573 0.1202 0.1165 0.1158 0.1000 0.1091 0.1574 0.1402 0.1402 0.1431 0.1178 0.1241 0.1388 0.0989 0.0906 0.0894 0.0929 0.0855 0.1012 0.1058 0.0995 0.1132 0.0933 0.0945 0.1325 0.1236 0.1243
va: 5.5158 1.9635 2.0389 1.8958 1.8835 2.0027 2.1109 1.9160 2.1186 2.0000 3.3475 2.8948 3.7743 3.5173 3.8088 3.9072 3.3575 3.8092 3.9939 3.9362 4.1132 3.8851 3.8613 4.1336 3.8617 3.8150 3.8759 3.9221 3.9472 3.9706 3.9043 4.2661 3.8463 1.0027 1.0159 0.9928 1.0098 1.0305 1.0154 1.0085 1.0032 1.0131 1.0142 1.0063 1.0166 0.9942 0.9932 1.0059 1.0067 1.0062 0.9970 0.9983 1.0086 1.0091 1.0114 0.9921 0.9888 0.9895 0.9948 0.9912 0.9928
dispcorr: -0.035659806 hartree
energy: -2002.022052368230
dipole: -9.26672 6.57317 -2.69356 -1.55718 1.76500 0.20782 -20.06849 17.44005 -2.62844
magnitude: 3.76923 au
magnitude: 9.58063 debye
