program: Orca
programVersion: 5.0.2
elementType: S O O O O O O O O O N N C C C C C C C C C C C C C C C C C C C C C H H H H H H H H H H H H H H H H H H H H H H H H H H H H
charge: 0
multiplicity: 1
keywords: wb97x-d3
keywords: def2-TZVPP
keywords: def2/J RIJCOSX
keywords: DEFGRID2
keywords: scfconv7
keywords: smallprint printgap noloewdin
keywords: NOSOSCF
formula: C21H28N2O9S
InChI: InChI=1/C21H28N2O9S/c1-7-23-20(31-14(3)32-21(25)29-5)16(12-22-23)18(24)15-8-9-17(33(6,26)27)19(13(15)2)30-11-10-28-4/h8-9,12,14H,7,10-11H2,1-6H3
61 atoms
S  5.084931 -0.347681 1.206415
O  3.386536 0.355041 -1.148961
O  -3.944918 1.038242 1.4295
O  5.468744 -0.571691 2.601525
O  5.316506 -1.444184 0.266597
O  -1.116056 2.283359 1.284456
O  -4.785438 0.848741 -0.711657
O  3.148721 0.585067 -3.974737
O  -4.960429 -0.518307 -2.339205
O  -2.896349 -0.002395 -1.618937
N  -3.484112 -1.211609 1.768563
N  -2.454299 -2.066609 1.897485
C  1.345501 0.763158 0.036117
C  0.691961 0.757376 1.271418
C  3.359891 0.097902 1.206214
C  2.692425 0.387981 0.015175
C  -1.675573 0.011699 1.510828
C  -0.763315 1.116865 1.351737
C  1.354303 0.438617 2.448704
C  2.701723 0.132014 2.424965
C  -3.070547 0.035319 1.533636
C  0.623712 1.143558 -1.223784
C  -4.846659 -1.703705 1.894562
C  -1.372405 -1.34902 1.733175
C  5.940716 1.1021 0.642079
C  3.111367 -0.759319 -2.009165
C  -4.084526 1.699456 0.181611
C  -5.20553 -2.704076 0.814823
C  3.760794 -0.51335 -3.341092
C  -4.922762 2.923014 0.41652
C  3.713102 0.86092 -5.235625
C  -4.094266 0.095271 -1.566811
C  -4.428628 -1.429338 -3.308206
H  0.821532 0.440247 3.390591
H  3.221103 -0.088934 3.346223
H  -0.018535 0.332889 -1.572131
H  -0.007685 2.015937 -1.068514
H  1.310536 1.387899 -2.029437
H  -4.944309 -2.152572 2.882601
H  -5.513365 -0.845966 1.864234
H  -0.399089 -1.811417 1.79212
H  7.007322 0.883053 0.700528
H  5.667938 1.330273 -0.384103
H  5.700224 1.936989 1.296799
H  3.517583 -1.675554 -1.57648
H  2.033739 -0.898105 -2.130529
H  -3.107805 1.952571 -0.230848
H  -5.154027 -2.260822 -0.178484
H  -6.227085 -3.046807 0.974613
H  -4.553578 -3.575619 0.839535
H  3.648231 -1.428857 -3.936905
H  4.83915 -0.345356 -3.213995
H  -5.058972 3.46047 -0.520202
H  -5.902265 2.666178 0.820056
H  -4.417638 3.58777 1.114942
H  3.598401 0.02036 -5.929369
H  4.780587 1.098018 -5.164789
H  3.196423 1.724198 -5.653508
H  -3.778822 -0.917007 -4.016109
H  -5.288173 -1.831782 -3.834986
H  -3.886149 -2.242539 -2.827869
elementType: S O N C H
totalener: -2001.98598968 hartree
nucrepener: 3863.52305094 hartree
electener: -5865.50904062 hartree
twoeener: 4564.10158339 hartree
cpcmener: -0.06521309 hartree
kineticenergy: 1994.39824338 hartree
xcener: -168.582841213972 hartree
chargesum: -0.0000000
charge: 0.879787 -0.388630 -0.330714 -0.576495 -0.563434 -0.468619 -0.288745 -0.378007 -0.292682 -0.473795 0.160096 -0.340537 -0.057548 0.067915 -0.109899 0.233432 -0.184133 0.428194 -0.186528 -0.088323 0.201673 -0.306534 -0.051528 -0.040378 -0.254787 -0.009575 0.238470 -0.240177 0.041418 -0.256811 -0.111650 0.589355 -0.125155 0.153853 0.158669 0.120430 0.118007 0.106656 0.113338 0.106719 0.158021 0.141000 0.139492 0.143539 0.118380 0.120781 0.138371 0.085057 0.099914 0.089837 0.091303 0.084860 0.100476 0.104809 0.102375 0.093528 0.094695 0.112936 0.130861 0.133800 0.122639
qa: 0.8798 -0.3886 -0.3307 -0.5765 -0.5634 -0.4686 -0.2887 -0.3780 -0.2927 -0.4738 0.1601 -0.3405 -0.0575 0.0679 -0.1099 0.2334 -0.1841 0.4282 -0.1865 -0.0883 0.2017 -0.3065 -0.0515 -0.0404 -0.2548 -0.0096 0.2385 -0.2402 0.0414 -0.2568 -0.1116 0.5894 -0.1252 0.1539 0.1587 0.1204 0.1180 0.1067 0.1133 0.1067 0.1580 0.1410 0.1395 0.1435 0.1184 0.1208 0.1384 0.0851 0.0999 0.0898 0.0913 0.0849 0.1005 0.1048 0.1024 0.0935 0.0947 0.1129 0.1309 0.1338 0.1226
va: 5.5144 1.9575 2.0583 1.8957 1.8841 2.0027 2.1010 1.9186 2.1182 1.9959 3.3453 2.8949 3.8451 3.4927 3.8238 3.8610 3.3995 3.8188 3.9800 3.9205 4.1452 3.8798 3.8590 4.1253 3.8620 3.8187 3.8537 3.9223 3.9477 3.9788 3.9038 4.2681 3.8394 1.0003 1.0149 1.0003 1.0122 1.0343 1.0032 1.0125 1.0011 1.0131 1.0149 1.0061 1.0160 0.9949 0.9996 1.0043 1.0079 1.0134 0.9965 0.9982 1.0082 1.0086 1.0089 0.9889 0.9893 0.9922 0.9937 0.9945 0.9906
dispcorr: -0.035754122 hartree
energy: -2002.021743798836
dipole: -8.69365 6.03237 -2.66128 -1.38795 1.67403 0.28608 -24.13105 21.73586 -2.39519
magnitude: 3.59183 au
magnitude: 9.12970 debye
