program: Orca
programVersion: 5.0.2
elementType: S O O O O O O O O O N N C C C C C C C C C C C C C C C C C C C C C H H H H H H H H H H H H H H H H H H H H H H H H H H H H
charge: 0
multiplicity: 1
keywords: wb97x-d3
keywords: def2-TZVPP
keywords: def2/J RIJCOSX
keywords: DEFGRID2
keywords: scfconv7
keywords: smallprint printgap noloewdin
keywords: NOSOSCF
formula: C21H28N2O9S
InChI: InChI=1/C21H28N2O9S/c1-7-23-20(31-14(3)32-21(25)29-5)16(12-22-23)18(24)15-8-9-17(33(6,26)27)19(13(15)2)30-11-10-28-4/h8-9,12,14H,7,10-11H2,1-6H3
61 atoms
S  5.192098 0.245884 1.105287
O  3.263211 -0.356216 -1.055692
O  -3.956387 0.757501 1.521058
O  5.705712 0.693869 2.401305
O  5.572924 -1.094367 0.661536
O  -1.179337 2.010097 1.790805
O  -4.941413 1.437079 -0.442579
O  3.895193 -1.715643 -3.71673
O  -5.429017 0.66458 -2.371734
O  -3.273227 0.635927 -1.741349
N  -3.475522 -1.487059 1.190912
N  -2.434584 -2.331474 1.06132
C  1.24736 0.227257 0.104907
C  0.681522 0.663898 1.306316
C  3.416992 0.387319 1.175977
C  2.636484 0.060298 0.068765
C  -1.680248 -0.217078 1.256717
C  -0.791185 0.901504 1.452549
C  1.468032 0.971667 2.411827
C  2.840992 0.844749 2.35087
C  -3.074727 -0.219627 1.308021
C  0.433938 0.01179 -1.138363
C  -4.829885 -2.014777 1.19493
C  -1.36252 -1.582995 1.091915
C  5.704388 1.4307 -0.112563
C  3.132039 -1.750683 -1.368649
C  -4.051825 1.825626 0.593121
C  -5.246026 -2.581364 -0.147811
C  4.156779 -2.151564 -2.403012
C  -4.650875 3.001292 1.30917
C  4.218597 -0.367051 -3.980411
C  -4.434316 0.883871 -1.543977
C  -5.099122 0.053573 -3.625079
H  1.006247 1.317115 3.326972
H  3.446097 1.100111 3.208782
H  -0.462317 0.628875 -1.144047
H  1.007564 0.271386 -2.027499
H  0.113626 -1.025262 -1.249046
H  -4.876181 -2.783986 1.965638
H  -5.499548 -1.214128 1.500309
H  -0.38384 -2.033047 1.021879
H  6.794737 1.417825 -0.120677
H  5.32675 1.157197 -1.093754
H  5.34911 2.417936 0.174234
H  3.301221 -2.348041 -0.468534
H  2.123573 -1.968934 -1.729687
H  -3.075799 2.067656 0.174278
H  -5.25882 -1.815396 -0.922794
H  -6.254077 -2.986355 -0.06338
H  -4.587532 -3.388107 -0.468599
H  4.151488 -3.243719 -2.433592
H  5.157779 -1.841866 -2.076974
H  -3.985296 3.317376 2.110676
H  -4.764351 3.835447 0.619077
H  -5.625287 2.76182 1.735044
H  4.263443 -0.244859 -5.062776
H  5.19604 -0.092993 -3.567774
H  3.473362 0.333661 -3.594282
H  -4.657065 -0.931039 -3.479781
H  -4.421892 0.681804 -4.20229
H  -6.038525 -0.04813 -4.159257
elementType: S O N C H
totalener: -2001.98445677 hartree
nucrepener: 3865.05964127 hartree
electener: -5867.04409804 hartree
twoeener: 4564.34650585 hartree
cpcmener: -0.06492272 hartree
kineticenergy: 1994.39513887 hartree
xcener: -168.584263266901 hartree
chargesum: 0.0000000
charge: 0.876284 -0.384106 -0.328021 -0.576323 -0.561622 -0.478201 -0.288078 -0.400842 -0.291116 -0.475176 0.153878 -0.340002 -0.155604 0.137269 -0.108172 0.262685 -0.177659 0.454570 -0.197302 -0.105325 0.226042 -0.294090 -0.047659 -0.056633 -0.249486 -0.004434 0.230560 -0.238645 0.029279 -0.251498 -0.108395 0.583206 -0.119873 0.147941 0.157106 0.108837 0.127319 0.120522 0.111027 0.106274 0.166379 0.141492 0.133272 0.145062 0.112346 0.113460 0.137881 0.083154 0.099565 0.090380 0.105600 0.085382 0.097816 0.101225 0.105019 0.121040 0.096945 0.088278 0.120093 0.127423 0.133653
qa: 0.8763 -0.3841 -0.3280 -0.5763 -0.5616 -0.4782 -0.2881 -0.4008 -0.2911 -0.4752 0.1539 -0.3400 -0.1556 0.1373 -0.1082 0.2627 -0.1777 0.4546 -0.1973 -0.1053 0.2260 -0.2941 -0.0477 -0.0566 -0.2495 -0.0044 0.2306 -0.2386 0.0293 -0.2515 -0.1084 0.5832 -0.1199 0.1479 0.1571 0.1088 0.1273 0.1205 0.1110 0.1063 0.1664 0.1415 0.1333 0.1451 0.1123 0.1135 0.1379 0.0832 0.0996 0.0904 0.1056 0.0854 0.0978 0.1012 0.1050 0.1210 0.0969 0.0883 0.1201 0.1274 0.1337
va: 5.5183 1.9554 2.0580 1.8955 1.8856 1.9981 2.1072 1.8976 2.1168 1.9958 3.3452 2.8951 3.7831 3.4362 3.8681 3.8391 3.3775 3.7650 4.0561 3.9517 4.1066 3.9040 3.8610 4.1153 3.8610 3.7528 3.8707 3.9262 3.9477 3.9674 3.8974 4.2820 3.8422 1.0102 1.0169 1.0137 1.0018 0.9892 1.0044 1.0118 0.9962 1.0138 1.0112 1.0078 1.0098 1.0043 0.9985 0.9999 1.0078 1.0121 0.9980 1.0169 1.0135 1.0082 1.0089 0.9928 0.9919 0.9840 0.9894 0.9939 0.9944
dispcorr: -0.037230868 hartree
energy: -2002.021687635906
dipole: -9.09855 5.97497 -3.12357 -4.50378 5.13770 0.63391 -21.44832 19.28894 -2.15937
magnitude: 3.84986 au
magnitude: 9.78557 debye
