program: Orca
programVersion: 5.0.2
elementType: S O O O O O O O O O N N C C C C C C C C C C C C C C C C C C C C C H H H H H H H H H H H H H H H H H H H H H H H H H H H H
charge: 0
multiplicity: 1
keywords: wb97x-d3
keywords: def2-TZVPP
keywords: def2/J RIJCOSX
keywords: DEFGRID2
keywords: scfconv7
keywords: smallprint printgap noloewdin
keywords: NOSOSCF
formula: C21H28N2O9S
InChI: InChI=1/C21H28N2O9S/c1-7-23-20(31-14(3)32-21(25)29-5)16(12-22-23)18(24)15-8-9-17(33(6,26)27)19(13(15)2)30-11-10-28-4/h8-9,12,14H,7,10-11H2,1-6H3
61 atoms
S  5.042294 -0.475868 1.017945
O  3.276549 0.31553 -1.215915
O  -3.96118 1.049015 1.457192
O  5.473163 -0.850848 2.365775
O  5.256863 -1.460813 -0.042092
O  -1.094518 2.216001 1.488879
O  -4.752981 0.972523 -0.707378
O  3.803556 0.278474 -4.221086
O  -4.926871 -0.338553 -2.384292
O  -2.867213 0.117487 -1.618376
N  -3.571365 -1.230977 1.676538
N  -2.567433 -2.122303 1.760721
C  1.265534 0.662403 0.037768
C  0.661936 0.645344 1.297245
C  3.318431 -0.039998 1.117019
C  2.611472 0.294252 -0.038439
C  -1.726045 -0.047611 1.509903
C  -0.780704 1.037513 1.437872
C  1.366263 0.298295 2.442758
C  2.706371 -0.032243 2.360581
C  -3.119455 0.014999 1.524281
C  0.508142 1.048358 -1.198276
C  -4.949078 -1.686707 1.768798
C  -1.464132 -1.427463 1.647674
C  5.862507 1.03617 0.586143
C  3.013388 -0.761384 -2.126017
C  -4.044956 1.765042 0.233919
C  -5.317656 -2.653858 0.662708
C  4.016433 -0.723854 -3.253837
C  -4.837887 3.012514 0.495304
C  4.176664 1.58413 -3.835539
C  -4.063818 0.233952 -1.578003
C  -4.387152 -1.218064 -3.378409
H  0.870968 0.294688 3.404969
H  3.255382 -0.283763 3.256731
H  1.165503 1.473599 -1.954527
H  0.012199 0.183575 -1.641573
H  -0.256949 1.792151 -0.988127
H  -5.078875 -2.151906 2.745689
H  -5.589911 -0.809351 1.743118
H  -0.503959 -1.918818 1.685302
H  5.535836 1.376948 -0.392614
H  5.648624 1.788471 1.342369
H  6.932407 0.82668 0.565932
H  3.1094 -1.717525 -1.605718
H  1.99504 -0.695113 -2.517496
H  -3.049529 1.995854 -0.145525
H  -4.704549 -3.553162 0.691167
H  -5.218565 -2.196918 -0.321066
H  -6.356977 -2.954677 0.788699
H  3.934331 -1.678667 -3.777948
H  5.033066 -0.665664 -2.843445
H  -4.311571 3.636379 1.215592
H  -4.942638 3.580976 -0.427053
H  -5.830683 2.785437 0.883514
H  4.288945 2.176481 -4.743993
H  5.133989 1.597484 -3.302278
H  3.426803 2.07295 -3.207442
H  -3.741508 -0.67921 -4.070678
H  -5.242337 -1.613713 -3.916994
H  -3.836186 -2.039267 -2.921697
elementType: S O N C H
totalener: -2001.98295524 hartree
nucrepener: 3885.41461067 hartree
electener: -5887.39756592 hartree
twoeener: 4584.98170814 hartree
cpcmener: -0.06492511 hartree
kineticenergy: 1994.40967680 hartree
xcener: -168.585698948177 hartree
chargesum: 0.0000000
charge: 0.877594 -0.381905 -0.331863 -0.576742 -0.563332 -0.466293 -0.289528 -0.400882 -0.293060 -0.472979 0.158994 -0.339419 -0.050366 0.076881 -0.121508 0.248843 -0.175324 0.420512 -0.173528 -0.090333 0.200359 -0.332035 -0.050216 -0.039214 -0.246924 -0.009517 0.241107 -0.239397 0.030388 -0.258508 -0.105006 0.588826 -0.125972 0.150764 0.156425 0.123047 0.123400 0.113017 0.113629 0.106247 0.157692 0.133039 0.143524 0.140279 0.111435 0.117389 0.138121 0.089858 0.084537 0.099638 0.104874 0.084869 0.102631 0.100540 0.105610 0.120061 0.096332 0.085048 0.131926 0.134295 0.122120
qa: 0.8776 -0.3819 -0.3319 -0.5767 -0.5633 -0.4663 -0.2895 -0.4009 -0.2931 -0.4730 0.1590 -0.3394 -0.0504 0.0769 -0.1215 0.2488 -0.1753 0.4205 -0.1735 -0.0903 0.2004 -0.3320 -0.0502 -0.0392 -0.2469 -0.0095 0.2411 -0.2394 0.0304 -0.2585 -0.1050 0.5888 -0.1260 0.1508 0.1564 0.1230 0.1234 0.1130 0.1136 0.1062 0.1577 0.1330 0.1435 0.1403 0.1114 0.1174 0.1381 0.0899 0.0845 0.0996 0.1049 0.0849 0.1026 0.1005 0.1056 0.1201 0.0963 0.0850 0.1319 0.1343 0.1221
va: 5.5191 1.9454 2.0568 1.8948 1.8843 2.0044 2.1024 1.8976 2.1189 1.9995 3.3498 2.8929 3.7915 3.4903 3.8646 3.8502 3.3822 3.8433 3.9888 3.9445 4.1412 3.9112 3.8567 4.1229 3.8622 3.7444 3.8560 3.9230 3.9439 3.9800 3.9040 4.2719 3.8384 1.0014 1.0150 0.9967 0.9958 1.0125 1.0025 1.0131 1.0017 1.0120 1.0078 1.0136 1.0148 1.0032 0.9960 1.0134 1.0045 1.0079 0.9980 1.0155 1.0088 1.0082 1.0085 0.9928 0.9926 0.9793 0.9935 0.9946 0.9912
dispcorr: -0.037507172 hartree
energy: -2002.020462412929
dipole: -8.43797 5.46304 -2.97493 1.74319 -0.76548 0.97771 -19.42077 18.15908 -1.26169
magnitude: 3.37608 au
magnitude: 8.58133 debye
