program: Orca
programVersion: 5.0.2
elementType: S O O O O O O O O O N N C C C C C C C C C C C C C C C C C C C C C H H H H H H H H H H H H H H H H H H H H H H H H H H H H
charge: 0
multiplicity: 1
keywords: wb97x-d3
keywords: def2-TZVPP
keywords: def2/J RIJCOSX
keywords: DEFGRID2
keywords: scfconv7
keywords: smallprint printgap noloewdin
keywords: NOSOSCF
formula: C21H28N2O9S
InChI: InChI=1/C21H28N2O9S/c1-7-23-20(31-14(3)32-21(25)29-5)16(12-22-23)18(24)15-8-9-17(33(6,26)27)19(13(15)2)30-11-10-28-4/h8-9,12,14H,7,10-11H2,1-6H3
61 atoms
S  3.544398 1.703134 -0.445276
O  2.445808 -1.049285 -0.593507
O  -1.78097 -0.005285 0.36953
O  2.955263 1.721615 -1.78485
O  3.918658 2.995683 0.133451
O  -0.363509 -0.84042 4.415981
O  -2.572516 1.615853 -1.044234
O  3.634465 -2.195434 -2.868767
O  -3.252011 1.276881 -3.041018
O  -1.271035 0.406554 -2.43855
N  -3.723286 -0.806173 1.40844
N  -4.119559 -1.346061 2.574573
C  0.941503 -0.912435 1.265578
C  0.470542 -0.134399 2.324704
C  2.391196 0.937784 0.676499
C  1.901201 -0.343525 0.423313
C  -1.938964 -0.800662 2.694301
C  -0.608817 -0.63105 3.239446
C  0.989209 1.126466 2.591192
C  1.956055 1.671621 1.767576
C  -2.430064 -0.467565 1.435833
C  0.475744 -2.323099 1.054914
C  -4.648844 -0.705162 0.289929
C  -3.065143 -1.34188 3.350473
C  4.998159 0.684017 -0.456059
C  1.641265 -1.301828 -1.751221
C  -1.709915 1.378336 0.056483
C  -4.375174 -1.723319 -0.79991
C  2.28845 -2.429179 -2.520602
C  -2.132017 2.308739 1.158038
C  3.809015 -1.253405 -3.906184
C  -2.26999 1.034607 -2.203288
C  -3.115845 0.735931 -4.360293
H  0.625074 1.695592 3.436405
H  2.350409 2.655581 1.976031
H  1.265637 -2.940545 0.629025
H  0.178389 -2.78951 1.992819
H  -0.378636 -2.379548 0.37874
H  -5.640864 -0.849965 0.710742
H  -4.616345 0.309197 -0.101563
H  -3.126246 -1.727602 4.356267
H  5.758932 1.236346 -1.007532
H  5.334455 0.523684 0.566281
H  4.799697 -0.262759 -0.947789
H  0.629266 -1.609226 -1.477554
H  1.561995 -0.387995 -2.344968
H  -0.673615 1.555419 -0.236333
H  -3.387169 -1.602894 -1.242955
H  -5.111562 -1.601034 -1.593787
H  -4.45825 -2.741109 -0.419014
H  1.673678 -2.622614 -3.409611
H  2.277673 -3.337841 -1.91332
H  -3.180241 2.187247 1.430235
H  -1.51726 2.156845 2.042186
H  -1.979464 3.334995 0.826824
H  4.859691 -1.273131 -4.195517
H  3.563087 -0.231558 -3.601956
H  3.204552 -1.502753 -4.785185
H  -4.008592 1.041109 -4.897031
H  -3.063151 -0.351808 -4.335254
H  -2.236957 1.137396 -4.86316
elementType: S O N C H
totalener: -2001.98008351 hartree
nucrepener: 4093.72511226 hartree
electener: -6095.70519577 hartree
twoeener: 4792.25039616 hartree
cpcmener: -0.06871311 hartree
kineticenergy: 1994.40968239 hartree
xcener: -168.589565364999 hartree
chargesum: 0.0000000
charge: 0.878822 -0.383833 -0.348109 -0.558172 -0.577293 -0.460811 -0.300740 -0.404097 -0.294168 -0.482346 0.182180 -0.342831 -0.103510 0.129430 -0.143109 0.278480 -0.159300 0.401180 -0.242416 -0.064880 0.216347 -0.291072 -0.055062 -0.076021 -0.259455 -0.028789 0.282098 -0.257916 0.039954 -0.288237 -0.117095 0.576182 -0.121448 0.152119 0.158392 0.123519 0.121037 0.113782 0.110766 0.108802 0.153970 0.142088 0.149466 0.132789 0.116453 0.119714 0.131561 0.088320 0.102488 0.099066 0.088920 0.099241 0.126405 0.114848 0.121278 0.120547 0.092712 0.107119 0.132849 0.122557 0.125231
qa: 0.8788 -0.3838 -0.3481 -0.5582 -0.5773 -0.4608 -0.3007 -0.4041 -0.2942 -0.4823 0.1822 -0.3428 -0.1035 0.1294 -0.1431 0.2785 -0.1593 0.4012 -0.2424 -0.0649 0.2163 -0.2911 -0.0551 -0.0760 -0.2595 -0.0288 0.2821 -0.2579 0.0400 -0.2882 -0.1171 0.5762 -0.1214 0.1521 0.1584 0.1235 0.1210 0.1138 0.1108 0.1088 0.1540 0.1421 0.1495 0.1328 0.1165 0.1197 0.1316 0.0883 0.1025 0.0991 0.0889 0.0992 0.1264 0.1148 0.1213 0.1205 0.0927 0.1071 0.1328 0.1226 0.1252
va: 5.5120 1.9693 2.0015 1.8890 1.8944 2.0219 2.1035 1.8868 2.1126 1.9982 3.3027 2.8947 3.7948 3.3290 3.7924 3.8168 3.4766 3.8705 4.0241 3.8779 4.0924 3.9203 3.8499 4.1490 3.8497 3.7792 3.8413 3.9064 3.9803 3.9518 3.8725 4.2912 3.8458 1.0064 1.0149 1.0070 0.9989 0.9916 1.0132 1.0131 1.0145 1.0142 1.0061 1.0268 1.0022 1.0028 0.9998 1.0138 1.0062 1.0053 1.0030 0.9980 0.9972 1.0064 1.0088 0.9912 0.9935 0.9961 0.9948 0.9906 0.9935
dispcorr: -0.042365108 hartree
energy: -2002.022448620847
dipole: -5.31114 3.02202 -2.28912 -10.98584 10.33258 -0.65326 -20.83766 18.59498 -2.24268
magnitude: 3.27054 au
magnitude: 8.31305 debye
