program: Orca
programVersion: 5.0.2
elementType: S O O O O O O O O O N N C C C C C C C C C C C C C C C C C C C C C H H H H H H H H H H H H H H H H H H H H H H H H H H H H
charge: 0
multiplicity: 1
keywords: wb97x-d3
keywords: def2-TZVPP
keywords: def2/J RIJCOSX
keywords: DEFGRID2
keywords: scfconv7
keywords: smallprint printgap noloewdin
keywords: NOSOSCF
formula: C21H28N2O9S
InChI: InChI=1/C21H28N2O9S/c1-7-23-20(31-14(3)32-21(25)29-5)16(12-22-23)18(24)15-8-9-17(33(6,26)27)19(13(15)2)30-11-10-28-4/h8-9,12,14H,7,10-11H2,1-6H3
61 atoms
S  5.280685 0.40009 1.186845
O  3.360201 -0.215593 -1.006865
O  -3.889925 0.645179 1.350309
O  5.775356 0.821066 2.499309
O  5.714021 -0.907292 0.695346
O  -1.157248 1.970107 1.866036
O  -4.834917 1.338696 -0.628978
O  2.786393 -1.221004 -3.613496
O  -5.2694 0.471635 -2.530248
O  -3.131886 0.478817 -1.840907
N  -3.311014 -1.558888 0.937376
N  -2.240987 -2.372964 0.873571
C  1.343202 0.314289 0.159579
C  0.757595 0.699186 1.368663
C  3.5014 0.479612 1.25258
C  2.735098 0.165781 0.132218
C  -1.56773 -0.251963 1.234184
C  -0.723544 0.888042 1.499969
C  1.529351 0.988299 2.489419
C  2.905433 0.894274 2.434139
C  -2.959372 -0.292826 1.165752
C  0.549773 0.135179 -1.102747
C  -4.654985 -2.10392 0.835731
C  -1.197449 -1.599993 1.034316
C  5.746711 1.646677 0.014452
C  3.276292 -1.61449 -1.318684
C  -3.981429 1.726404 0.436837
C  -5.221946 -2.506719 2.182499
C  3.713816 -1.819754 -2.740117
C  -4.6273 2.877711 1.151494
C  3.133395 -1.397294 -4.967343
C  -4.298382 0.733952 -1.687836
C  -4.903264 -0.177075 -3.753454
H  1.053938 1.294968 3.41146
H  3.498087 1.140825 3.303205
H  0.267898 -0.904736 -1.273871
H  -0.367151 0.720184 -1.085376
H  1.122744 0.462302 -1.968372
H  -5.289754 -1.365151 0.350412
H  -4.591004 -2.959408 0.166743
H  -0.203106 -2.019943 1.025543
H  5.36789 2.611023 0.345693
H  6.836684 1.665685 -0.008361
H  5.363127 1.403822 -0.972159
H  3.930453 -2.182686 -0.654645
H  2.256797 -1.982619 -1.175749
H  -2.998129 1.994444 0.049615
H  -5.310599 -1.64986 2.84976
H  -4.599936 -3.259741 2.665317
H  -6.216371 -2.929828 2.044298
H  3.781216 -2.902165 -2.913002
H  4.722076 -1.409775 -2.890759
H  -4.745363 3.718318 0.470159
H  -5.605498 2.606965 1.548609
H  -3.991071 3.198774 1.974259
H  2.375502 -0.905186 -5.575712
H  3.166938 -2.456454 -5.247252
H  4.107556 -0.954129 -5.202952
H  -4.459519 -1.153306 -3.564238
H  -4.215103 0.43626 -4.333245
H  -5.827805 -0.302347 -4.308061
elementType: S O N C H
totalener: -2001.98678449 hartree
nucrepener: 3855.40652169 hartree
electener: -5857.39330617 hartree
twoeener: 4555.74469423 hartree
cpcmener: -0.06604067 hartree
kineticenergy: 1994.40863561 hartree
xcener: -168.584740218719 hartree
chargesum: -0.0000000
charge: 0.875880 -0.392110 -0.334402 -0.576058 -0.562258 -0.474736 -0.290244 -0.380265 -0.293746 -0.477969 0.158368 -0.335526 -0.145779 0.122279 -0.098066 0.247997 -0.144836 0.441775 -0.189107 -0.109745 0.208776 -0.277069 -0.038143 -0.071503 -0.255638 -0.006972 0.231458 -0.248855 0.042406 -0.252563 -0.112691 0.596230 -0.120085 0.149063 0.157421 0.115410 0.106258 0.118808 0.101504 0.108789 0.166340 0.143768 0.140918 0.140328 0.118596 0.118813 0.138149 0.089730 0.089121 0.098945 0.089565 0.085284 0.101714 0.105022 0.097062 0.114230 0.094226 0.095060 0.123700 0.122974 0.132401
qa: 0.8759 -0.3921 -0.3344 -0.5761 -0.5623 -0.4747 -0.2902 -0.3803 -0.2937 -0.4780 0.1584 -0.3355 -0.1458 0.1223 -0.0981 0.2480 -0.1448 0.4418 -0.1891 -0.1097 0.2088 -0.2771 -0.0381 -0.0715 -0.2556 -0.0070 0.2315 -0.2489 0.0424 -0.2526 -0.1127 0.5962 -0.1201 0.1491 0.1574 0.1154 0.1063 0.1188 0.1015 0.1088 0.1663 0.1438 0.1409 0.1403 0.1186 0.1188 0.1381 0.0897 0.0891 0.0989 0.0896 0.0853 0.1017 0.1050 0.0971 0.1142 0.0942 0.0951 0.1237 0.1230 0.1324
va: 5.5174 1.9517 2.0406 1.8963 1.8855 2.0021 2.1096 1.9190 2.1188 1.9977 3.3411 2.8917 3.7922 3.4419 3.8284 3.8764 3.3523 3.7872 4.0464 3.9446 4.0973 3.8812 3.8657 4.1266 3.8606 3.8250 3.8768 3.9231 3.9499 3.9660 3.9038 4.2652 3.8472 1.0094 1.0162 0.9957 1.0180 1.0258 1.0135 1.0079 0.9980 1.0059 1.0132 1.0153 1.0152 0.9951 0.9953 1.0067 1.0066 1.0057 0.9962 0.9979 1.0085 1.0092 1.0139 0.9920 0.9892 0.9892 0.9912 0.9929 0.9948
dispcorr: -0.035471749 hartree
energy: -2002.022256234394
dipole: -10.71600 7.94015 -2.77585 -7.62872 7.42208 -0.20664 -20.44178 17.46936 -2.97242
magnitude: 4.07226 au
magnitude: 10.35087 debye
