program: Orca
programVersion: 5.0.2
elementType: S O O O O O O O O O N N C C C C C C C C C C C C C C C C C C C C C H H H H H H H H H H H H H H H H H H H H H H H H H H H H
charge: 0
multiplicity: 1
keywords: wb97x-d3
keywords: def2-TZVPP
keywords: def2/J RIJCOSX
keywords: DEFGRID2
keywords: scfconv7
keywords: smallprint printgap noloewdin
keywords: NOSOSCF
formula: C21H28N2O9S
InChI: InChI=1/C21H28N2O9S/c1-7-23-20(31-14(3)32-21(25)29-5)16(12-22-23)18(24)15-8-9-17(33(6,26)27)19(13(15)2)30-11-10-28-4/h8-9,12,14H,7,10-11H2,1-6H3
61 atoms
S  5.239706 0.140815 1.153438
O  3.283817 -0.027659 -1.082849
O  -3.886056 0.734921 1.345542
O  5.762021 0.266282 2.515781
O  5.569385 -1.081469 0.421307
O  -1.133166 2.049138 1.890987
O  -4.753685 1.190452 -0.736545
O  2.821327 -0.52882 -3.841965
O  -5.106563 0.13251 -2.55591
O  -2.989122 0.288389 -1.825871
N  -3.326309 -1.504314 1.111458
N  -2.262509 -2.328269 1.113781
C  1.301132 0.427781 0.175441
C  0.75339 0.712001 1.428536
C  3.472501 0.346273 1.246542
C  2.682534 0.222012 0.103304
C  -1.577314 -0.193916 1.347671
C  -0.720372 0.945317 1.572628
C  1.545239 0.836155 2.562578
C  2.912793 0.658813 2.475838
C  -2.966632 -0.228289 1.258688
C  0.453379 0.400349 -1.064114
C  -4.674727 -2.043867 1.04445
C  -1.214228 -1.55336 1.234741
C  5.801605 1.543715 0.226459
C  3.099542 -1.344032 -1.621752
C  -3.953342 1.70854 0.315235
C  -5.263231 -2.305682 2.416753
C  3.619518 -1.358278 -3.030975
C  -4.644623 2.918768 0.872121
C  3.255918 -0.510231 -5.181645
C  -4.167511 0.509975 -1.720831
C  -4.69106 -0.62789 -3.696062
H  1.095578 1.068876 3.518719
H  3.526658 0.763548 3.35888
H  -0.346875 1.136606 -1.008453
H  1.038525 0.63434 -1.950705
H  -0.006508 -0.576103 -1.22326
H  -5.295659 -1.350577 0.480594
H  -4.610997 -2.962015 0.464736
H  -0.222019 -1.977674 1.260967
H  5.400676 1.514432 -0.783067
H  5.493881 2.456339 0.732564
H  6.890192 1.489982 0.192455
H  3.65406 -2.072478 -1.026904
H  2.044589 -1.629346 -1.598299
H  -2.956579 1.950908 -0.056091
H  -6.258254 -2.735622 2.306686
H  -5.35738 -1.385869 2.99343
H  -4.653508 -3.009162 2.982865
H  3.597702 -2.398368 -3.382536
H  4.670166 -1.037427 -3.050343
H  -4.734763 3.680944 0.100139
H  -5.639347 2.677611 1.246669
H  -4.052305 3.33327 1.686119
H  4.281477 -0.13567 -5.275891
H  2.595413 0.152448 -5.739614
H  3.215213 -1.505037 -5.639673
H  -4.227143 -1.566193 -3.395176
H  -4.004406 -0.058948 -4.321257
H  -5.597392 -0.837566 -4.255348
elementType: S O N C H
totalener: -2001.98681754 hartree
nucrepener: 3864.47531203 hartree
electener: -5866.46212957 hartree
twoeener: 4564.84323920 hartree
cpcmener: -0.06652810 hartree
kineticenergy: 1994.41035945 hartree
xcener: -168.584360917936 hartree
chargesum: 0.0000000
charge: 0.875914 -0.387381 -0.334931 -0.575571 -0.563182 -0.468644 -0.289545 -0.379595 -0.293842 -0.476598 0.162367 -0.333716 -0.093589 0.078412 -0.098628 0.243667 -0.130278 0.422750 -0.174089 -0.109456 0.190346 -0.298276 -0.036551 -0.069010 -0.253563 -0.009102 0.230217 -0.248990 0.041424 -0.253754 -0.111685 0.595173 -0.120254 0.151710 0.157237 0.111334 0.116653 0.118024 0.101182 0.108397 0.161601 0.139297 0.142636 0.140356 0.118532 0.122344 0.140495 0.098887 0.090158 0.089409 0.090271 0.084716 0.101211 0.105537 0.098594 0.094924 0.113654 0.093228 0.123987 0.123247 0.132344
qa: 0.8759 -0.3874 -0.3349 -0.5756 -0.5632 -0.4686 -0.2895 -0.3796 -0.2938 -0.4766 0.1624 -0.3337 -0.0936 0.0784 -0.0986 0.2437 -0.1303 0.4228 -0.1741 -0.1095 0.1903 -0.2983 -0.0366 -0.0690 -0.2536 -0.0091 0.2302 -0.2490 0.0414 -0.2538 -0.1117 0.5952 -0.1203 0.1517 0.1572 0.1113 0.1167 0.1180 0.1012 0.1084 0.1616 0.1393 0.1426 0.1404 0.1185 0.1223 0.1405 0.0989 0.0902 0.0894 0.0903 0.0847 0.1012 0.1055 0.0986 0.0949 0.1137 0.0932 0.1240 0.1232 0.1323
va: 5.5182 1.9603 2.0377 1.8960 1.8848 2.0051 2.1100 1.9180 2.1187 2.0006 3.3414 2.8894 3.7521 3.4954 3.8196 3.8982 3.3520 3.8115 4.0281 3.9411 4.1025 3.8857 3.8641 4.1312 3.8618 3.8157 3.8782 3.9221 3.9500 3.9689 3.9040 4.2673 3.8470 1.0051 1.0162 1.0116 1.0328 0.9910 1.0144 1.0086 1.0008 1.0144 1.0063 1.0129 1.0165 0.9939 0.9912 1.0059 1.0069 1.0062 0.9965 0.9992 1.0085 1.0091 1.0125 0.9890 0.9922 0.9890 0.9910 0.9929 0.9949
dispcorr: -0.035735902 hartree
energy: -2002.022553446266
dipole: -10.68121 7.89800 -2.78321 -4.50106 4.57017 0.06911 -20.58999 17.79577 -2.79422
magnitude: 3.94445 au
magnitude: 10.02600 debye
