program: Orca
programVersion: 5.0.2
elementType: S O O O O O O O O O N N C C C C C C C C C C C C C C C C C C C C C H H H H H H H H H H H H H H H H H H H H H H H H H H H H
charge: 0
multiplicity: 1
keywords: wb97x-d3
keywords: def2-TZVPP
keywords: def2/J RIJCOSX
keywords: DEFGRID2
keywords: scfconv7
keywords: smallprint printgap noloewdin
keywords: NOSOSCF
formula: C21H28N2O9S
InChI: InChI=1/C21H28N2O9S/c1-7-23-20(31-14(3)32-21(25)29-5)16(12-22-23)18(24)15-8-9-17(33(6,26)27)19(13(15)2)30-11-10-28-4/h8-9,12,14H,7,10-11H2,1-6H3
61 atoms
S  5.190216 0.194696 1.136092
O  3.261193 -0.351547 -1.047089
O  -3.951872 0.772029 1.51909
O  5.699414 0.610385 2.442447
O  5.542107 -1.141883 0.663609
O  -1.179961 2.041959 1.768765
O  -4.937965 1.413056 -0.456507
O  3.770647 -1.67015 -3.728107
O  -5.395142 0.625844 -2.384696
O  -3.247883 0.622546 -1.730089
N  -3.463877 -1.468291 1.190732
N  -2.422473 -2.310978 1.072823
C  1.252122 0.253946 0.109289
C  0.685975 0.69124 1.310287
C  3.418625 0.375293 1.191625
C  2.638608 0.067443 0.077946
C  -1.671909 -0.195054 1.267791
C  -0.787539 0.931526 1.451572
C  1.471576 0.987391 2.41902
C  2.843111 0.840023 2.363698
C  -3.066256 -0.199909 1.311337
C  0.43822 0.057045 -1.13719
C  -4.814684 -2.002537 1.202781
C  -1.351329 -1.56181 1.108815
C  5.73339 1.394149 -0.053767
C  3.123203 -1.745578 -1.355401
C  -4.065489 1.828657 0.581411
C  -5.21402 -2.604654 -0.130024
C  4.096578 -2.133355 -2.44192
C  -4.698382 2.99406 1.285735
C  4.162267 -0.348635 -4.016669
C  -4.411994 0.859186 -1.547211
C  -5.04464 0.031812 -3.637577
H  1.01059 1.33754 3.33314
H  3.449371 1.083551 3.224763
H  -0.432011 0.710592 -1.154003
H  1.025518 0.285143 -2.025996
H  0.075116 -0.966443 -1.242185
H  -4.860526 -2.75302 1.992415
H  -5.490878 -1.19742 1.481805
H  -0.370809 -2.010492 1.047141
H  5.409439 2.385154 0.257941
H  6.823361 1.352326 -0.069201
H  5.344106 1.158265 -1.040496
H  3.338684 -2.344641 -0.466228
H  2.099442 -1.96886 -1.668665
H  -3.091382 2.091419 0.169597
H  -5.233694 -1.855187 -0.920757
H  -6.215582 -3.026183 -0.047012
H  -4.537728 -3.404922 -0.429405
H  4.084514 -3.225597 -2.491434
H  5.114349 -1.836737 -2.1559
H  -4.82801 3.822335 0.590739
H  -5.670356 2.732663 1.705213
H  -4.0476 3.33088 2.091394
H  4.10657 -0.218325 -5.098216
H  5.195146 -0.149435 -3.707057
H  3.515966 0.403816 -3.555479
H  -4.58115 -0.944847 -3.501189
H  -4.377338 0.677707 -4.208135
H  -5.978373 -0.08658 -4.179504
elementType: S O N C H
totalener: -2001.98568772 hartree
nucrepener: 3868.07698423 hartree
electener: -5870.06267195 hartree
twoeener: 4567.35280727 hartree
cpcmener: -0.05291278 hartree
kineticenergy: 1994.42646874 hartree
xcener: -168.586507255715 hartree
chargesum: 0.0000000
charge: 0.866635 -0.377656 -0.322908 -0.559415 -0.546152 -0.447642 -0.283285 -0.384030 -0.286885 -0.452040 0.155156 -0.336074 -0.160417 0.140543 -0.111561 0.261537 -0.167068 0.420247 -0.194121 -0.104691 0.219296 -0.292710 -0.050094 -0.060564 -0.254846 -0.009621 0.228928 -0.238096 0.033585 -0.251197 -0.110395 0.560828 -0.120439 0.145506 0.155896 0.109447 0.125454 0.117597 0.110636 0.105122 0.162588 0.142065 0.139505 0.130478 0.109043 0.112793 0.136307 0.081982 0.097855 0.091970 0.100689 0.083564 0.099086 0.103225 0.099379 0.118503 0.093767 0.086703 0.118088 0.125994 0.131912
qa: 0.8666 -0.3777 -0.3229 -0.5594 -0.5462 -0.4476 -0.2833 -0.3840 -0.2869 -0.4520 0.1552 -0.3361 -0.1604 0.1405 -0.1116 0.2615 -0.1671 0.4202 -0.1941 -0.1047 0.2193 -0.2927 -0.0501 -0.0606 -0.2548 -0.0096 0.2289 -0.2381 0.0336 -0.2512 -0.1104 0.5608 -0.1204 0.1455 0.1559 0.1094 0.1255 0.1176 0.1106 0.1051 0.1626 0.1421 0.1395 0.1305 0.1090 0.1128 0.1363 0.0820 0.0979 0.0920 0.1007 0.0836 0.0991 0.1032 0.0994 0.1185 0.0938 0.0867 0.1181 0.1260 0.1319
va: 5.5438 1.9603 2.0660 1.9168 1.9051 2.0346 2.1088 1.9136 2.1177 2.0214 3.3400 2.8934 3.7774 3.4313 3.8728 3.8391 3.3575 3.8103 4.0544 3.9511 4.1148 3.9073 3.8630 4.1156 3.8639 3.7652 3.8781 3.9253 3.9514 3.9677 3.9050 4.3097 3.8489 1.0104 1.0182 1.0137 1.0026 0.9904 1.0045 1.0123 0.9972 1.0085 1.0142 1.0120 1.0124 1.0022 0.9998 1.0008 1.0082 1.0125 0.9988 1.0160 1.0087 1.0092 1.0131 0.9929 0.9926 0.9832 0.9899 0.9941 0.9945
dispcorr: -0.037186064 hartree
energy: -2002.022873787776
dipole: -8.99411 6.08521 -2.90890 -4.40508 5.07544 0.67036 -21.58342 19.51417 -2.06925
magnitude: 3.63220 au
magnitude: 9.23232 debye
