program: Gaussian 09
title: 000059634
version: EM64L-G09RevD.01
frameworkgroup: C1[X(C16H33N3O)]
method: RPBEPBE
basis: SDD
operation: Freq
keyword: #p
keyword: freq=noraman
keyword: PBEPBE/SDD
title: #p freq=noraman PBEPBE/SDD
converged: NO YES NO NO
title: Mulliken charges:
elementType: O N N N C C C C C C C C C C C C C C C C H H H H H H H H H H H H H H H H H H H H H H H H H H H H H H H H H
charge: -0.190203 -0.117428 -0.105480 -0.101774 -0.078041 -0.076946 -0.438753 -0.454644 -0.473267 -0.471188 -0.396313 -0.571261 -0.575170 -0.368471 -0.360254 -0.324502 -0.331099 -0.575483 -0.344387 -0.339777 0.285313 0.286806 0.239592 0.245767 0.265949 0.237017 0.257744 0.246360 0.252330 0.257360 0.229012 0.264402 0.289332 0.269314 0.270529 0.274366 0.269180 0.275803 0.231455 0.255613 0.280507 0.274022 0.271379 0.276515 0.278813 0.258482 0.278423 0.272438 0.268939 0.225006 0.291561 0.287591 0.227522
chargesum: 2.00000
title: Mulliken charges with hydrogens summed into heavy atoms:
elementType: O N N N C C C C C C C C C C C C C C C C
charge: -0.190203 -0.117428 -0.105480 -0.101774 0.207272 0.209860 0.046606 0.048322 0.030837 0.038503 0.097101 0.257914 0.244180 0.118596 0.194274 0.223391 0.206196 0.244317 0.172179 0.175336
polarizability: 2.17000211e+02 3.35931989e+00 1.70073096e+02 -1.32908471e+00 5.82199236e-01 1.60294423e+02
1716.lowfreq: -10.1582 -0.0006 -0.0005 -0.0001 1.4311 7.3606 21.6103 35.6557 41.3638
frequency: 19.5349 35.5867 41.3304 79.7747 101.3913 107.4017 135.0562 162.2278 178.0061 181.3758 205.8435 216.7918 238.6937 267.6500 292.1258 297.5902 312.6455 327.9496 339.6805 365.0050 380.1684 390.8915 419.6597 421.6506 426.7378 433.5093 441.1379 464.2406 475.3430 483.9056 504.7638 565.6925 616.4902 634.2971 639.3582 679.9198 740.1274 774.4470 782.0555 787.7819 796.5373 808.0073 816.3075 849.3902 857.8216 872.2582 877.7552 881.4399 935.4351 945.2859 959.0112 971.8648 986.5412 988.5740 995.2298 998.0131 1005.5709 1018.6606 1037.4398 1051.2701 1058.9177 1082.2467 1084.7961 1093.9700 1094.2703 1106.4291 1133.7531 1136.9866 1142.2480 1149.0218 1160.1916 1167.7968 1180.9130 1202.1715 1203.7380 1208.5199 1228.2849 1242.4096 1251.8126 1253.3858 1260.2566 1268.9323 1276.4780 1295.9408 1316.1104 1317.6912 1321.7591 1328.7080 1335.3071 1342.4645 1344.0891 1346.9233 1351.8074 1360.6916 1365.3948 1369.7910 1372.6183 1378.2846 1394.2075 1410.4550 1414.2199 1427.9411 1438.1394 1446.0256 1446.3361 1452.6612 1457.7047 1458.0441 1462.8972 1466.6273 1469.4259 1473.7048 1478.6711 1478.9410 1482.3358 1490.6283 1492.0551 1495.0253 1506.5355 1515.9800 2886.4240 2901.4951 2911.4893 2976.1299 2978.8602 3012.8045 3014.2008 3026.6217 3028.3937 3029.7729 3030.1741 3031.4015 3032.3494 3033.5216 3034.8083 3035.1814 3038.1839 3042.0168 3054.2882 3059.1165 3063.3987 3097.7560 3098.0495 3100.2875 3102.2907 3108.7284 3112.5243 3133.9128 3139.8401 3145.0762 3159.2608 3176.2035 3191.3386
redmass: 3.3855 3.5908 3.6794 1.6821 1.8613 3.4888 3.5830 2.3547 2.0447 1.2769 2.5211 1.1995 2.0225 2.7081 2.1683 2.4898 2.8655 2.4474 2.6315 3.0517 2.2237 1.9280 2.1414 2.4235 3.0212 2.5467 2.0293 2.7843 3.0749 3.0882 3.1057 2.0805 2.1619 4.1551 3.5626 3.5981 3.0465 1.4661 2.3698 2.0564 1.9343 3.7361 3.0238 1.7146 2.7519 3.3378 2.2127 2.3359 2.2969 2.7879 2.2780 2.2042 1.9373 2.3784 2.7570 2.5122 1.6379 2.0996 1.7184 2.4413 2.6487 2.3076 1.3040 1.9407 3.1483 1.9089 1.3077 2.0695 1.5815 1.4909 1.8640 1.4094 1.8131 1.6106 1.2601 1.6093 1.7337 1.3261 1.2657 1.2383 1.2569 1.3381 1.2097 1.3058 1.2855 1.6110 1.4304 1.3077 1.3527 1.2974 1.2844 1.3059 1.2879 1.2840 1.3947 1.3550 1.2886 1.3128 1.3422 1.2797 1.1699 1.1553 1.0870 1.1507 1.0806 1.0659 1.0690 1.0591 1.0682 1.0765 1.0903 1.0528 1.0645 1.0626 1.0820 1.0653 1.0751 1.0587 1.0788 1.0603 1.0719 1.0713 1.0701 1.0697 1.0693 1.0639 1.0643 1.0612 1.0740 1.0592 1.0740 1.0555 1.0366 1.0776 1.0449 1.0595 1.0616 1.0880 1.0905 1.1008 1.1012 1.0956 1.1017 1.0971 1.1071 1.1076 1.1084 1.1055 1.1047 1.1052 1.1029 1.1014 1.1005
irintensity: 0.9107 1.0167 0.5264 0.8533 1.7423 1.0130 1.7354 5.1265 0.7187 0.5504 0.0807 0.0017 0.1872 5.0455 0.5325 2.2154 1.2305 3.3192 7.7936 1.0616 3.8683 0.1977 1.0695 0.1205 1.1531 3.7589 1.7357 0.4082 0.7236 3.3432 8.1451 1.0886 4.2920 0.0855 0.8092 4.7993 3.9340 7.5030 5.3344 9.3371 1.3975 3.3594 2.1721 4.2276 63.7417 50.5571 16.9948 8.3319 18.6504 19.5919 2.5519 3.2936 7.7868 8.7234 12.7272 12.5286 18.9649 6.8956 11.3890 4.0812 11.6729 41.0093 0.6627 8.4971 21.5477 5.6243 0.2495 14.0982 3.5907 1.5896 25.4287 5.5213 1.5285 0.7813 8.9819 7.8547 0.7126 10.0469 8.8995 19.9131 2.0028 9.2268 2.2479 9.8972 2.7811 1.9346 2.9196 0.8799 2.2892 3.2035 2.7365 1.7330 0.0741 7.7739 0.8609 0.7617 0.4710 3.1402 0.1980 3.4997 4.0401 26.2846 7.3345 32.9887 12.3642 17.7549 10.6876 12.0131 15.0870 5.8727 4.7026 17.7596 70.0176 62.6290 14.3489 70.0457 14.3441 1.2506 11.0396 4.3337 47.8165 55.3783 78.9024 14.9843 43.6630 5.7013 8.1723 0.5385 17.1976 11.6999 4.9059 5.2931 4.7039 23.1503 3.9908 5.2299 6.6793 4.1946 7.4033 12.2487 2.6758 2.2267 33.6972 2.8731 3.7779 2.9038 10.5526 0.0051 2.4622 2.9654 3.2433 6.7410 2.0177
temp: 298.150 k
press: 1.00000 atm
elementType: 8 7 7 7 6 6 6 6 6 6 6 6 6 6 6 6 6 6 6 6 1 1 1 1 1 1 1 1 1 1 1 1 1 1 1 1 1 1 1 1 1 1 1 1 1 1 1 1 1 1 1 1 1
symmnumber: 1
zpe: 1278208.8 jmol-1
zpe.correction: 0.486844 hartree
zpe.thermalcorrener: 0.507218 hartree
zpe.thermalcorrenthalpy: 0.508162 hartree
zpe.thermalcorrgfe: 0.438312 hartree
zpe.sumelectzpe: -866.731120 hartree
zpe.sumelectthermal: -866.710746 hartree
zpe.sumelectthermalent: -866.709802 hartree
zpe.sumelectthermalfe: -866.779652 hartree
dipole: -3.2493 -1.7838 2.0953
dipole: 4.2579
quadrupole: 10.2432 -96.4235 -103.5243
quadrupole: 10.1022 15.6321 0.4470
quadrupole: 73.4781 -33.1886 -40.2895 10.1022 15.6321 0.4470
hfenergy: -867.2179641 hartree
pointgroup: C01 [X(C16H33N3O1)]
dipole: -1.2605372 0.5697226 -0.9448598 debye
polarizability: 216.6421732|-5.2092539|170.2575133|1.495503|-1.5559222|160.4680437 unknown
InChI: InChI=1S/C16H33N3O/c1-18(2)15-5-4-6-16(18)14-17(13-15)7-8-19(3)9-11-20-12-10-19/h15-16H,4-14H2,1-3H3
charge 2 multiplicity 1
53 atoms
O  5.595414 0.107372 1.038713
N  -3.702852 0.825173 0.121122
N  -0.842441 0.185786 -0.411516
N  3.014668 -0.338818 -0.353164
C  -2.689576 0.526314 1.279299
C  -3.263224 -0.085141 -1.077562
C  -1.256806 0.901399 0.820624
C  -1.829423 0.303081 -1.516821
C  -2.840486 -0.943887 1.743422
C  -3.427468 -1.57734 -0.695805
C  -2.68929 -1.98788 0.605562
C  -5.143476 0.523584 0.550139
C  -3.698984 2.306632 -0.264047
C  0.554525 0.456971 -0.830684
C  1.501988 -0.496096 -0.059162
C  3.750858 -1.432387 0.482905
C  3.515283 1.055039 0.114425
C  3.286671 -0.549571 -1.842051
C  5.273362 -1.223374 0.51902
C  5.051484 1.136053 0.152213
H  -2.971684 1.207637 2.10417
H  -3.950786 0.162903 -1.908135
H  -1.159428 2.009245 0.715899
H  -0.590397 0.618206 1.655797
H  -1.550074 -0.403298 -2.319193
H  -1.83025 1.316812 -1.982378
H  -3.804247 -1.06667 2.268469
H  -2.070559 -1.120427 2.516937
H  -3.042996 -2.17178 -1.544705
H  -4.501836 -1.826062 -0.63681
H  -1.619618 -2.122537 0.381782
H  -3.077956 -2.961546 0.952315
H  -5.260708 -0.523443 0.844291
H  -5.397197 1.174152 1.401629
H  -5.811727 0.743157 -0.297154
H  -4.031497 2.895747 0.604681
H  -2.701086 2.638936 -0.567618
H  -4.401624 2.453864 -1.098987
H  0.833929 1.523519 -0.666305
H  0.627344 0.261876 -1.914676
H  1.240851 -1.540534 -0.302213
H  1.390506 -0.356459 1.030009
H  3.480424 -2.411725 0.051034
H  3.34637 -1.35527 1.506231
H  3.114535 1.198202 1.132685
H  3.092439 1.81407 -0.564321
H  4.368245 -0.627277 -2.014971
H  2.798627 -1.482151 -2.165068
H  2.893355 0.303206 -2.414322
H  5.752159 -1.387175 -0.468508
H  5.709761 -1.943067 1.229861
H  5.344183 2.103506 0.590144
H  5.500917 1.066469 -0.860303
