program: Orca
programVersion: 5.0.2
elementType: S O O O O O O O O O N N C C C C C C C C C C C C C C C C C C C C C H H H H H H H H H H H H H H H H H H H H H H H H H H H H
charge: 0
multiplicity: 1
keywords: wb97x-d3
keywords: def2-TZVPP
keywords: def2/J RIJCOSX
keywords: DEFGRID2
keywords: scfconv7
keywords: smallprint printgap noloewdin
keywords: NOSOSCF
formula: C21H28N2O9S
InChI: InChI=1/C21H28N2O9S/c1-7-23-20(31-14(3)32-21(25)29-5)16(12-22-23)18(24)15-8-9-17(33(6,26)27)19(13(15)2)30-11-10-28-4/h8-9,12,14H,7,10-11H2,1-6H3
61 atoms
S  5.151464 0.384656 1.032037
O  3.222739 0.041059 -1.199089
O  -3.992005 0.707498 1.570092
O  5.662295 0.71454 2.361424
O  5.45703 -0.940468 0.498457
O  -1.269144 2.154442 1.756446
O  -5.02244 1.355531 -0.382819
O  4.017957 -2.822477 -3.278164
O  -5.38141 0.722564 -2.387059
O  -3.249321 0.901257 -1.707903
N  -3.36906 -1.474356 1.126826
N  -2.282998 -2.241809 0.932002
C  1.214568 0.54343 0.004994
C  0.649823 0.897091 1.233536
C  3.38375 0.61478 1.084643
C  2.602253 0.376365 -0.044323
C  -1.659665 -0.091454 1.193787
C  -0.830805 1.074045 1.399506
C  1.437809 1.144238 2.352106
C  2.810523 1.010529 2.282824
C  -3.04884 -0.188103 1.285725
C  0.391869 0.404606 -1.243336
C  -4.682236 -2.094357 1.159925
C  -1.260825 -1.427498 0.963841
C  5.749081 1.623833 -0.092104
C  3.099315 -1.324126 -1.607198
C  -4.215418 1.799277 0.696551
C  -5.156718 -2.527878 -0.212826
C  4.099171 -1.531211 -2.733692
C  -4.990996 2.832658 1.461983
C  4.587788 -3.829745 -2.474125
C  -4.432875 0.981454 -1.516713
C  -4.96331 0.272374 -3.678666
H  0.977158 1.436338 3.286654
H  3.4194 1.206113 3.154212
H  0.962251 0.70629 -2.121143
H  0.056015 -0.620158 -1.409368
H  -0.495318 1.033698 -1.207866
H  -4.613147 -2.950178 1.83122
H  -5.378872 -1.388022 1.606955
H  -0.257755 -1.810063 0.846674
H  5.363769 1.451227 -1.093007
H  5.453347 2.607947 0.266361
H  6.837209 1.547684 -0.098085
H  3.301557 -1.984013 -0.759862
H  2.087109 -1.532365 -1.965149
H  -3.273151 2.198537 0.322169
H  -5.309072 -1.675795 -0.873707
H  -6.110183 -3.047059 -0.116817
H  -4.449464 -3.21041 -0.683752
H  5.114259 -1.313537 -2.375549
H  3.878138 -0.832005 -3.544389
H  -5.200497 3.688368 0.821965
H  -5.935369 2.432747 1.832514
H  -4.401218 3.18182 2.308269
H  4.637746 -4.739726 -3.072163
H  3.997805 -4.049485 -1.578144
H  5.604623 -3.572872 -2.155212
H  -5.876973 0.084532 -4.235132
H  -4.386944 -0.649974 -3.61211
H  -4.378714 1.034651 -4.193165
elementType: S O N C H
totalener: -2001.98465308 hartree
nucrepener: 3852.41078169 hartree
electener: -5854.39543477 hartree
twoeener: 4551.76309626 hartree
cpcmener: -0.05201504 hartree
kineticenergy: 1994.41993544 hartree
xcener: -168.585097352724 hartree
chargesum: 0.0000000
charge: 0.868431 -0.386321 -0.321879 -0.559273 -0.543738 -0.447440 -0.284273 -0.387126 -0.288216 -0.450697 0.154481 -0.334732 -0.146046 0.141241 -0.108814 0.244256 -0.166853 0.418373 -0.193874 -0.106245 0.216259 -0.300204 -0.050653 -0.062570 -0.264627 -0.010976 0.226741 -0.244716 0.041207 -0.250259 -0.106642 0.563696 -0.123170 0.147109 0.156254 0.126292 0.118306 0.112273 0.109058 0.106763 0.161652 0.137742 0.143305 0.140071 0.112663 0.115699 0.136803 0.084940 0.099432 0.091639 0.079759 0.100063 0.098759 0.102341 0.101198 0.116342 0.093717 0.092820 0.131544 0.120530 0.127589
qa: 0.8684 -0.3863 -0.3219 -0.5593 -0.5437 -0.4474 -0.2843 -0.3871 -0.2882 -0.4507 0.1545 -0.3347 -0.1460 0.1412 -0.1088 0.2443 -0.1669 0.4184 -0.1939 -0.1062 0.2163 -0.3002 -0.0507 -0.0626 -0.2646 -0.0110 0.2267 -0.2447 0.0412 -0.2503 -0.1066 0.5637 -0.1232 0.1471 0.1563 0.1263 0.1183 0.1123 0.1091 0.1068 0.1617 0.1377 0.1433 0.1401 0.1127 0.1157 0.1368 0.0849 0.0994 0.0916 0.0798 0.1001 0.0988 0.1023 0.1012 0.1163 0.0937 0.0928 0.1315 0.1205 0.1276
va: 5.5426 1.9746 2.0702 1.9172 1.9090 2.0331 2.1053 1.9309 2.1176 2.0233 3.3395 2.8982 3.7846 3.4364 3.8696 3.8581 3.3608 3.8114 4.0493 3.9450 4.1162 3.9046 3.8680 4.1175 3.8610 3.7431 3.8761 3.9190 3.9337 3.9681 3.9066 4.3030 3.8481 1.0092 1.0180 1.0053 0.9885 1.0140 1.0063 1.0096 0.9975 1.0150 1.0073 1.0132 0.9996 0.9985 1.0027 1.0063 1.0081 1.0111 1.0133 0.9989 1.0089 1.0096 1.0111 0.9914 0.9812 0.9928 0.9949 0.9913 0.9936
dispcorr: -0.036441404 hartree
energy: -2002.021094485086
dipole: -8.37524 5.48550 -2.88974 -10.17140 10.61147 0.44007 -18.63270 16.81443 -1.81827
magnitude: 3.44243 au
magnitude: 8.74996 debye
