program: Orca
programVersion: 5.0.2
elementType: S O O O O O O O O O N N C C C C C C C C C C C C C C C C C C C C C H H H H H H H H H H H H H H H H H H H H H H H H H H H H
charge: 0
multiplicity: 1
keywords: wb97x-d3
keywords: def2-TZVPP
keywords: def2/J RIJCOSX
keywords: DEFGRID2
keywords: scfconv7
keywords: smallprint printgap noloewdin
keywords: NOSOSCF
formula: C21H28N2O9S
InChI: InChI=1/C21H28N2O9S/c1-7-23-20(31-14(3)32-21(25)29-5)16(12-22-23)18(24)15-8-9-17(33(6,26)27)19(13(15)2)30-11-10-28-4/h8-9,12,14H,7,10-11H2,1-6H3
61 atoms
S  4.966252 -0.276516 1.299295
O  3.380585 0.530583 -1.079953
O  -4.0609 1.155176 1.455046
O  5.295259 -0.556971 2.695759
O  5.208409 -1.334381 0.321611
O  -1.227781 2.380653 1.185944
O  -4.848806 0.958615 -0.695067
O  4.099377 -1.526063 -3.919701
O  -4.908242 -0.352632 -2.374652
O  -2.912171 0.461669 -1.750824
N  -3.605336 -1.101763 1.712596
N  -2.582076 -1.96826 1.784219
C  1.280855 0.887878 0.019375
C  0.578664 0.855287 1.227576
C  3.248874 0.197177 1.254454
C  2.629877 0.522382 0.047135
C  -1.795099 0.11319 1.431203
C  -0.878405 1.216462 1.269984
C  1.196041 0.50958 2.422345
C  2.542705 0.199298 2.446085
C  -3.18848 0.148702 1.502025
C  0.613794 1.274741 -1.268446
C  -4.96374 -1.589844 1.879425
C  -1.498588 -1.256636 1.609045
C  5.864843 1.179486 0.82368
C  3.194507 -0.567308 -1.976866
C  -4.23018 1.842148 0.225851
C  -5.367893 -2.542198 0.772131
C  4.313991 -0.493282 -2.99358
C  -5.157493 2.995612 0.480519
C  5.128488 -1.624018 -4.871181
C  -4.101926 0.359184 -1.621765
C  -4.30697 -1.0922 -3.4406
H  0.627337 0.492288 3.343248
H  3.024887 -0.049508 3.38094
H  1.335227 1.617825 -2.00739
H  0.070489 0.432088 -1.700349
H  -0.100412 2.081974 -1.122978
H  -5.01841 -2.07997 2.851701
H  -5.627141 -0.728864 1.913642
H  -0.528107 -1.729728 1.620637
H  6.925169 0.933688 0.896744
H  5.623003 1.46324 -0.196752
H  5.629267 1.989046 1.51178
H  3.227572 -1.515082 -1.434316
H  2.224678 -0.495082 -2.477437
H  -3.267566 2.178537 -0.159088
H  -5.355365 -2.051632 -0.200585
H  -6.38179 -2.897326 0.955398
H  -4.71195 -3.41088 0.730829
H  5.284786 -0.603517 -2.491492
H  4.310325 0.489825 -3.486171
H  -5.311228 3.553009 -0.442375
H  -6.125731 2.660109 0.853232
H  -4.714961 3.672319 1.210192
H  4.880071 -2.437511 -5.552751
H  6.097755 -1.846059 -4.408484
H  5.238341 -0.704688 -5.459325
H  -3.812884 -0.431305 -4.152442
H  -5.123015 -1.608822 -3.937255
H  -3.594544 -1.824776 -3.061967
elementType: S O N C H
totalener: -2001.98558890 hartree
nucrepener: 3842.94789295 hartree
electener: -5844.93348185 hartree
twoeener: 4542.93181894 hartree
cpcmener: -0.05158940 hartree
kineticenergy: 1994.42535136 hartree
xcener: -168.584285994263 hartree
chargesum: 0.0000000
charge: 0.869390 -0.383027 -0.324919 -0.560067 -0.544114 -0.440354 -0.288598 -0.376003 -0.289660 -0.452534 0.159818 -0.336050 -0.036723 0.076493 -0.112399 0.218154 -0.171929 0.398749 -0.192232 -0.087641 0.191731 -0.321017 -0.054456 -0.041661 -0.263086 0.009160 0.233911 -0.238252 0.053805 -0.256568 -0.115694 0.576940 -0.125223 0.151114 0.157997 0.115593 0.121721 0.114451 0.111305 0.106837 0.155356 0.139679 0.137480 0.142752 0.106460 0.114563 0.138114 0.081814 0.097185 0.090909 0.073873 0.080964 0.097735 0.102386 0.103901 0.115381 0.093659 0.090535 0.128058 0.131410 0.122825
qa: 0.8694 -0.3830 -0.3249 -0.5601 -0.5441 -0.4404 -0.2886 -0.3760 -0.2897 -0.4525 0.1598 -0.3360 -0.0367 0.0765 -0.1124 0.2182 -0.1719 0.3987 -0.1922 -0.0876 0.1917 -0.3210 -0.0545 -0.0417 -0.2631 0.0092 0.2339 -0.2383 0.0538 -0.2566 -0.1157 0.5769 -0.1252 0.1511 0.1580 0.1156 0.1217 0.1145 0.1113 0.1068 0.1554 0.1397 0.1375 0.1428 0.1065 0.1146 0.1381 0.0818 0.0972 0.0909 0.0739 0.0810 0.0977 0.1024 0.1039 0.1154 0.0937 0.0905 0.1281 0.1314 0.1228
va: 5.5430 1.9741 2.0703 1.9162 1.9067 2.0369 2.1006 1.9351 2.1208 2.0311 3.3403 2.8931 3.8184 3.4750 3.8646 3.8664 3.3902 3.8402 3.9803 3.9286 4.1529 3.9047 3.8660 4.1220 3.8621 3.7863 3.8527 3.9170 3.9283 3.9815 3.9179 4.2888 3.8464 1.0008 1.0157 1.0035 0.9951 1.0149 1.0038 1.0109 1.0014 1.0134 1.0143 1.0074 1.0126 0.9974 1.0065 1.0119 1.0086 1.0135 1.0040 0.9956 1.0086 1.0091 1.0076 0.9919 0.9890 0.9879 0.9937 0.9953 0.9917
dispcorr: -0.035570787 hartree
energy: -2002.021159687872
dipole: -5.51857 3.10229 -2.41628 -3.22365 4.31000 1.08635 -22.53525 20.65617 -1.87908
magnitude: 3.24800 au
magnitude: 8.25577 debye
