program: Orca
programVersion: 5.0.2
elementType: S O O O O O O O O O N N C C C C C C C C C C C C C C C C C C C C C H H H H H H H H H H H H H H H H H H H H H H H H H H H H
charge: 0
multiplicity: 1
keywords: wb97x-d3
keywords: def2-TZVPP
keywords: def2/J RIJCOSX
keywords: DEFGRID2
keywords: scfconv7
keywords: smallprint printgap noloewdin
keywords: NOSOSCF
formula: C21H28N2O9S
InChI: InChI=1/C21H28N2O9S/c1-7-23-20(31-14(3)32-21(25)29-5)16(12-22-23)18(24)15-8-9-17(33(6,26)27)19(13(15)2)30-11-10-28-4/h8-9,12,14H,7,10-11H2,1-6H3
61 atoms
S  4.974614 -0.699846 1.195581
O  3.48203 0.393442 -1.161398
O  -4.027761 0.935344 1.330401
O  5.225191 -1.127143 2.563839
O  5.286215 -1.596604 0.094122
O  -1.165164 2.088604 0.982862
O  -4.813302 0.866804 -0.821295
O  3.764709 0.69969 -4.121658
O  -4.883501 -0.5300 -2.43678
O  -2.897269 0.377424 -1.920846
N  -3.634602 -1.34468 1.408724
N  -2.643249 -2.247954 1.420435
C  1.361982 0.691498 -0.096524
C  0.60475 0.524532 1.066404
C  3.258801 -0.206037 1.1185
C  2.69687 0.28042 -0.06261
C  -1.789593 -0.165514 1.228761
C  -0.842257 0.923726 1.086303
C  1.162491 0.01146 2.229216
C  2.501533 -0.329785 2.270861
C  -3.176425 -0.091245 1.307643
C  0.758023 1.309543 -1.325996
C  -5.003357 -1.778492 1.60507
C  -1.53968 -1.555613 1.300881
C  5.863613 0.828208 0.940104
C  3.33673 -0.653959 -2.124546
C  -4.158451 1.682698 0.135555
C  -5.362006 -1.889529 3.07644
C  4.210057 -0.358052 -3.320063
C  -5.03025 2.870005 0.439281
C  4.201039 1.978682 -3.74711
C  -4.074164 0.248019 -1.745171
C  -4.283261 -1.275393 -3.49013
H  0.550906 -0.104728 3.114925
H  2.950552 -0.702757 3.180479
H  -0.156024 0.795743 -1.627057
H  0.487682 2.346445 -1.127929
H  1.438518 1.305491 -2.17259
H  -5.662347 -1.08127 1.090793
H  -5.092066 -2.743394 1.108868
H  -0.585122 -2.05769 1.263491
H  5.64611 1.225119 -0.04707
H  5.588712 1.541114 1.713794
H  6.923142 0.587402 1.02112
H  3.64251 -1.606089 -1.684605
H  2.291013 -0.739793 -2.438316
H  -3.177098 1.987096 -0.228261
H  -6.382471 -2.256086 3.184869
H  -5.298298 -0.921208 3.572358
H  -4.696273 -2.584481 3.586863
H  4.204467 -1.254148 -3.947214
H  5.246803 -0.210474 -2.985588
H  -5.168874 3.467844 -0.459856
H  -6.008813 2.565333 0.809241
H  -4.547541 3.493089 1.189848
H  4.021843 2.644612 -4.59129
H  5.276087 1.997006 -3.526167
H  3.673089 2.378974 -2.876872
H  -3.826004 -0.622971 -4.233932
H  -5.089948 -1.838808 -3.949759
H  -3.527509 -1.964243 -3.112876
totalener: -2001.95283599 hartree
nucrepener: 3869.69995345 hartree
electener: -5871.65278944 hartree
twoeener: 4568.76527049 hartree
kineticenergy: 1994.53385308 hartree
xcener: -168.594265745315 hartree
chargesum: -0.0000000
charge: 0.851496 -0.371821 -0.310048 -0.489010 -0.484669 -0.366139 -0.275008 -0.327381 -0.266838 -0.386568 0.141346 -0.287107 -0.081059 0.092661 -0.160245 0.280070 -0.077884 0.315562 -0.211390 -0.048924 0.114525 -0.273850 -0.047658 -0.056304 -0.290895 -0.052235 0.209556 -0.244037 0.036667 -0.249101 -0.100196 0.519758 -0.126109 0.133050 0.151196 0.115106 0.120062 0.086509 0.094176 0.105820 0.130747 0.124525 0.127413 0.129370 0.120676 0.108428 0.145373 0.087159 0.085966 0.096821 0.083718 0.077327 0.085652 0.092090 0.105991 0.109517 0.075485 0.080335 0.113707 0.121069 0.115551
qa: 0.8515 -0.3718 -0.3100 -0.4890 -0.4847 -0.3661 -0.2750 -0.3274 -0.2668 -0.3866 0.1413 -0.2871 -0.0811 0.0927 -0.1602 0.2801 -0.0779 0.3156 -0.2114 -0.0489 0.1145 -0.2739 -0.0477 -0.0563 -0.2909 -0.0522 0.2096 -0.2440 0.0367 -0.2491 -0.1002 0.5198 -0.1261 0.1330 0.1512 0.1151 0.1201 0.0865 0.0942 0.1058 0.1307 0.1245 0.1274 0.1294 0.1207 0.1084 0.1454 0.0872 0.0860 0.0968 0.0837 0.0773 0.0857 0.0921 0.1060 0.1095 0.0755 0.0803 0.1137 0.1211 0.1156
va: 5.5858 1.9363 2.0751 2.0002 1.9748 2.1080 2.1093 1.9647 2.1294 2.0928 3.3245 2.8903 3.8979 3.4567 3.9831 3.6989 3.3868 3.8833 3.9781 3.9311 4.1421 3.9017 3.8804 4.1369 3.8833 3.7999 3.8750 3.9216 3.9701 3.9780 3.9265 4.3264 3.8857 1.0061 1.0213 1.0088 1.0071 1.0151 1.0161 1.0086 1.0068 1.0156 1.0124 1.0180 1.0175 0.9908 1.0103 1.0082 1.0067 1.0084 1.0022 1.0091 1.0117 1.0120 1.0080 0.9943 0.9976 0.9820 0.9950 0.9948 0.9932
dispcorr: -0.036122335 hartree
energy: -2001.988958323127
dipole: -7.00904 4.99987 -2.00917 5.15389 -4.40419 0.74970 -13.31840 12.59657 -0.72182
magnitude: 2.26271 au
magnitude: 5.75135 debye
