program: Orca
programVersion: 5.0.2
elementType: S O O O O O O O O O N N C C C C C C C C C C C C C C C C C C C C C H H H H H H H H H H H H H H H H H H H H H H H H H H H H
charge: 0
multiplicity: 1
keywords: wb97x-d3
keywords: def2-TZVPP
keywords: def2/J RIJCOSX
keywords: DEFGRID2
keywords: scfconv7
keywords: smallprint printgap noloewdin
keywords: NOSOSCF
formula: C21H28N2O9S
InChI: InChI=1/C21H28N2O9S/c1-7-23-20(31-14(3)32-21(25)29-5)16(12-22-23)18(24)15-8-9-17(33(6,26)27)19(13(15)2)30-11-10-28-4/h8-9,12,14H,7,10-11H2,1-6H3
61 atoms
S  5.10585 0.245265 1.010855
O  3.143963 0.014924 -1.237519
O  -4.03179 0.794437 1.618326
O  5.611154 0.475924 2.35553
O  5.41648 -1.004708 0.334351
O  -1.275044 2.18234 1.707401
O  -4.956513 1.323839 -0.40597
O  4.069594 -2.790331 -3.330302
O  -5.204788 0.543461 -2.377267
O  -3.158787 1.242722 -1.776386
N  -3.467005 -1.415985 1.217907
N  -2.407365 -2.215939 1.024048
C  1.160716 0.499355 0.003127
C  0.60864 0.849378 1.237098
C  3.336049 0.485397 1.073334
C  2.544552 0.307547 -0.059635
C  -1.726983 -0.07302 1.231469
C  -0.866341 1.082428 1.397094
C  1.406363 1.040544 2.358591
C  2.773241 0.858229 2.283808
C  -3.112201 -0.131913 1.350383
C  0.32778 0.385835 -1.242522
C  -4.7927 -1.998198 1.286167
C  -1.367203 -1.424102 1.025344
C  5.666855 1.594071 -0.017021
C  3.093338 -1.350393 -1.650301
C  -4.214422 1.840001 0.687861
C  -5.252854 -2.544457 -0.052845
C  4.069456 -1.492253 -2.808483
C  -5.027579 2.908398 1.36517
C  4.859103 -3.699533 -2.610141
C  -4.3183 1.054865 -1.543713
C  -4.720307 0.181669 -3.665248
H  0.953169 1.33559 3.295393
H  3.399079 1.000192 3.153594
H  0.892822 0.709638 -2.115169
H  0.002384 -0.639772 -1.426418
H  -0.572477 0.993457 -1.190768
H  -4.759358 -2.790658 2.033861
H  -5.474434 -1.231995 1.648638
H  -0.374613 -1.830609 0.902502
H  5.392199 2.538829 0.445962
H  6.75201 1.513969 -0.073669
H  5.234454 1.510417 -1.009899
H  3.370672 -2.00195 -0.818755
H  2.083286 -1.617035 -1.97779
H  -3.253428 2.224687 0.347504
H  -4.550596 -3.283984 -0.433604
H  -5.361564 -1.750121 -0.789539
H  -6.223342 -3.026172 0.061907
H  5.069368 -1.187137 -2.472768
H  3.769364 -0.820359 -3.616761
H  -4.469944 3.304262 2.211707
H  -5.220915 3.725299 0.67224
H  -5.98178 2.519614 1.71962
H  5.896809 -3.358461 -2.517555
H  4.854482 -4.641033 -3.157986
H  4.484493 -3.893388 -1.599185
H  -4.324398 1.044011 -4.201141
H  -5.577227 -0.215425 -4.20138
H  -3.944894 -0.5817 -3.602176
totalener: -2001.95234113 hartree
nucrepener: 3856.52492682 hartree
electener: -5858.47726795 hartree
twoeener: 4555.32211770 hartree
kineticenergy: 1994.52829167 hartree
xcener: -168.594804543181 hartree
chargesum: 0.0000000
charge: 0.847187 -0.367030 -0.305118 -0.487150 -0.483576 -0.359462 -0.266761 -0.331396 -0.270748 -0.385643 0.140982 -0.292497 -0.186022 0.166059 -0.139629 0.240988 -0.144405 0.328545 -0.147115 -0.089839 0.190516 -0.286920 -0.067348 -0.055167 -0.296574 -0.038302 0.199868 -0.230807 0.051546 -0.243436 -0.100983 0.508565 -0.130456 0.125956 0.149354 0.120625 0.093292 0.125454 0.104290 0.102922 0.134275 0.130355 0.129503 0.127575 0.107698 0.105132 0.142035 0.100162 0.076034 0.085735 0.067780 0.087298 0.108293 0.084391 0.092601 0.083208 0.106669 0.082102 0.120307 0.123423 0.115662
qa: 0.8472 -0.3670 -0.3051 -0.4871 -0.4836 -0.3595 -0.2668 -0.3314 -0.2707 -0.3856 0.1410 -0.2925 -0.1860 0.1661 -0.1396 0.2410 -0.1444 0.3285 -0.1471 -0.0898 0.1905 -0.2869 -0.0673 -0.0552 -0.2966 -0.0383 0.1999 -0.2308 0.0515 -0.2434 -0.1010 0.5086 -0.1305 0.1260 0.1494 0.1206 0.0933 0.1255 0.1043 0.1029 0.1343 0.1304 0.1295 0.1276 0.1077 0.1051 0.1420 0.1002 0.0760 0.0857 0.0678 0.0873 0.1083 0.0844 0.0926 0.0832 0.1067 0.0821 0.1203 0.1234 0.1157
va: 5.5916 1.9723 2.0869 2.0025 1.9751 2.1133 2.1156 1.9893 2.1230 2.0938 3.3303 2.8899 3.8148 3.4583 3.9452 3.8201 3.3868 3.8873 4.0344 3.9511 4.1077 3.9056 3.8913 4.1044 3.8796 3.8000 3.9055 3.9130 3.9573 3.9666 3.9419 4.3386 3.8767 1.0148 1.0229 1.0060 0.9955 1.0185 1.0057 1.0099 1.0029 1.0128 1.0172 1.0156 0.9995 0.9982 1.0058 1.0114 1.0154 1.0116 1.0150 0.9984 1.0100 1.0122 1.0122 0.9945 0.9909 0.9824 0.9960 0.9946 0.9931
dispcorr: -0.036380527 hartree
energy: -2001.988721659349
dipole: -7.65952 5.42589 -2.23363 -9.54287 9.92959 0.38672 -18.43326 17.25827 -1.17499
magnitude: 2.55328 au
magnitude: 6.48992 debye
