program: Orca
programVersion: 5.0.2
elementType: S O O O O O O O O O N N C C C C C C C C C C C C C C C C C C C C C H H H H H H H H H H H H H H H H H H H H H H H H H H H H
charge: 0
multiplicity: 1
keywords: wb97x-d3
keywords: def2-TZVPP
keywords: def2/J RIJCOSX
keywords: DEFGRID2
keywords: scfconv7
keywords: smallprint printgap noloewdin
keywords: NOSOSCF
formula: C21H28N2O9S
InChI: InChI=1/C21H28N2O9S/c1-7-23-20(31-14(3)32-21(25)29-5)16(12-22-23)18(24)15-8-9-17(33(6,26)27)19(13(15)2)30-11-10-28-4/h8-9,12,14H,7,10-11H2,1-6H3
61 atoms
S  5.065124 -1.664072 -0.20087
O  4.328248 0.669003 1.501735
O  -3.672284 0.998006 0.714258
O  4.886687 -2.842249 -1.036282
O  6.012844 -0.636042 -0.605108
O  -0.668088 1.804485 0.26119
O  -4.786374 1.376406 -1.255997
O  3.275339 2.831377 -0.399773
O  -5.984634 0.112018 -2.49613
O  -3.979568 -0.648359 -1.827161
N  -3.468709 -1.180622 1.431863
N  -2.558484 -2.128669 1.708303
C  1.965334 0.647892 1.106062
C  0.905365 0.060218 0.41281
C  3.441041 -0.951731 0.036417
C  3.251347 0.151279 0.86812
C  -1.534899 -0.292451 0.880281
C  -0.480135 0.627723 0.507408
C  1.110852 -1.015045 -0.447655
C  2.375146 -1.541163 -0.62527
C  -2.910901 -0.067934 0.944476
C  1.752173 1.747529 2.103141
C  -4.871448 -1.468051 1.650976
C  -1.407464 -1.613886 1.374635
C  5.5233 -2.239087 1.426715
C  4.930864 1.880099 1.023588
C  -3.615341 1.687103 -0.519198
C  -5.325499 -2.686208 0.866248
C  4.569494 2.295963 -0.383766
C  -3.645796 3.165949 -0.246389
C  2.581298 2.665432 -1.603917
C  -4.83295 0.193969 -1.860235
C  -6.224042 -1.093036 -3.21126
H  0.271935 -1.44658 -0.97849
H  2.537061 -2.391462 -1.272463
H  1.724395 2.720279 1.616187
H  0.813943 1.618246 2.640146
H  2.55275 1.761766 2.839817
H  -5.023644 -1.622559 2.720332
H  -5.439074 -0.584391 1.367043
H  -0.499427 -2.180247 1.512036
H  6.496041 -2.717834 1.318464
H  5.592294 -1.40385 2.116579
H  4.79222 -2.967184 1.769645
H  4.679904 2.689369 1.715978
H  6.006984 1.711795 1.071656
H  -2.728372 1.394971 -1.082517
H  -4.789963 -3.577688 1.185625
H  -5.153021 -2.550513 -0.200294
H  -6.390536 -2.85095 1.027933
H  4.675118 1.446842 -1.06839
H  5.309688 3.044689 -0.702079
H  -2.752562 3.447545 0.304412
H  -3.662303 3.720605 -1.183054
H  -4.526502 3.440431 0.333507
H  3.009711 3.259822 -2.419617
H  1.555219 2.988692 -1.436174
H  2.559145 1.615357 -1.920219
H  -6.238374 -1.958267 -2.547872
H  -5.475608 -1.25721 -3.986288
H  -7.20102 -0.974661 -3.670557
totalener: -2001.95028053 hartree
nucrepener: 3898.70898876 hartree
electener: -5900.65926929 hartree
twoeener: 4598.12875912 hartree
kineticenergy: 1994.52245688 hartree
xcener: -168.601031250656 hartree
chargesum: -0.0000000
charge: 0.848910 -0.382180 -0.315472 -0.489666 -0.485931 -0.401726 -0.258282 -0.324594 -0.260548 -0.392579 0.149016 -0.299908 -0.032162 0.099962 -0.194082 0.283934 -0.107031 0.293219 -0.270570 -0.040513 0.227386 -0.281840 -0.083814 -0.045956 -0.291156 0.020098 0.215212 -0.229046 -0.026494 -0.236673 -0.110513 0.494523 -0.119887 0.148746 0.152666 0.123241 0.101539 0.099269 0.107747 0.098816 0.130989 0.129033 0.133709 0.125013 0.092100 0.105496 0.125920 0.106567 0.075675 0.083901 0.105940 0.085412 0.105020 0.087002 0.092798 0.103571 0.108739 0.076936 0.105084 0.114591 0.122843
qa: 0.8489 -0.3822 -0.3155 -0.4897 -0.4859 -0.4017 -0.2583 -0.3246 -0.2605 -0.3926 0.1490 -0.2999 -0.0322 0.1000 -0.1941 0.2839 -0.1070 0.2932 -0.2706 -0.0405 0.2274 -0.2818 -0.0838 -0.0460 -0.2912 0.0201 0.2152 -0.2290 -0.0265 -0.2367 -0.1105 0.4945 -0.1199 0.1487 0.1527 0.1232 0.1015 0.0993 0.1077 0.0988 0.1310 0.1290 0.1337 0.1250 0.0921 0.1055 0.1259 0.1066 0.0757 0.0839 0.1059 0.0854 0.1050 0.0870 0.0928 0.1036 0.1087 0.0769 0.1051 0.1146 0.1228
va: 5.5854 1.9875 2.0796 1.9968 1.9779 2.0664 2.1331 1.9474 2.1342 2.0819 3.3086 2.9002 3.8231 3.3959 3.8995 3.6865 3.4186 3.8119 3.9885 3.9112 4.1153 3.9233 3.8942 4.1212 3.8741 3.8650 3.9443 3.9027 3.9291 3.9483 3.9114 4.3692 3.8951 0.9988 1.0213 1.0094 1.0052 1.0050 1.0026 1.0113 1.0040 1.0182 1.0175 1.0119 0.9978 1.0049 0.9995 1.0154 1.0193 1.0073 1.0126 1.0060 1.0218 1.0116 1.0125 0.9933 1.0015 0.9868 0.9878 0.9941 0.9948
dispcorr: -0.038572596 hartree
energy: -2001.988853123777
dipole: -8.77607 6.80516 -1.97090 6.54427 -6.23396 0.31031 0.51528 -0.12470 0.39058
magnitude: 2.03305 au
magnitude: 5.16761 debye
