program: Orca
programVersion: 5.0.2
elementType: S O O O O O O O O O N N C C C C C C C C C C C C C C C C C C C C C H H H H H H H H H H H H H H H H H H H H H H H H H H H H
charge: 0
multiplicity: 1
keywords: wb97x-d3
keywords: def2-TZVPP
keywords: def2/J RIJCOSX
keywords: DEFGRID2
keywords: scfconv7
keywords: smallprint printgap noloewdin
keywords: NOSOSCF
formula: C21H28N2O9S
InChI: InChI=1/C21H28N2O9S/c1-7-23-20(31-14(3)32-21(25)29-5)16(12-22-23)18(24)15-8-9-17(33(6,26)27)19(13(15)2)30-11-10-28-4/h8-9,12,14H,7,10-11H2,1-6H3
61 atoms
S  4.733938 -0.621611 -1.684455
O  4.168164 -1.133098 1.18996
O  -3.752948 0.078848 1.614758
O  4.493519 -0.31206 -3.086106
O  5.761633 0.108462 -0.956689
O  -0.745545 0.779105 1.90765
O  -4.501441 1.524201 0.003008
O  3.291021 1.557861 2.35182
O  -4.735449 1.662478 -2.113735
O  -2.65302 1.758892 -1.28209
N  -3.69141 -1.772864 0.219675
N  -2.841152 -2.541955 -0.47597
C  1.813678 -0.692396 1.155541
C  0.718274 -0.28241 0.396703
C  3.164505 -0.479791 -0.843583
C  3.05879 -0.745401 0.521183
C  -1.71243 -0.875764 0.547697
C  -0.617749 -0.059435 1.038787
C  0.835323 0.008781 -0.95904
C  2.057662 -0.106162 -1.591482
C  -3.065401 -0.771841 0.851052
C  1.67213 -1.092301 2.593499
C  -5.104917 -2.094025 0.21498
C  -1.660465 -2.008178 -0.295696
C  5.10987 -2.365313 -1.585442
C  4.867491 -0.200515 2.027108
C  -3.763211 1.4326 1.210411
C  -5.722557 -1.939188 -1.162766
C  4.548402 1.260679 1.810939
C  -4.47728 2.215257 2.277699
C  2.593307 2.580293 1.695286
C  -3.837858 1.656742 -1.146388
C  -4.229142 1.790063 -3.437405
H  -0.035784 0.332919 -1.514746
H  2.15845 0.102053 -2.6473
H  0.716695 -1.582744 2.775034
H  2.457934 -1.787213 2.882913
H  1.731049 -0.225772 3.249648
H  -5.209495 -3.119429 0.570552
H  -5.594446 -1.444178 0.936967
H  -0.787743 -2.448598 -0.752763
H  4.316704 -2.932564 -2.066538
H  6.044453 -2.509681 -2.126827
H  5.227992 -2.665721 -0.548837
H  4.677857 -0.463962 3.071941
H  5.926662 -0.357623 1.822517
H  -2.745327 1.793451 1.062243
H  -6.77068 -2.235106 -1.12942
H  -5.215202 -2.570489 -1.88988
H  -5.676991 -0.905644 -1.502464
H  4.608852 1.50774 0.745249
H  5.339271 1.841764 2.307795
H  -5.495738 1.856362 2.422447
H  -3.935545 2.12824 3.217555
H  -4.515103 3.268236 2.004106
H  3.055528 3.563905 1.843887
H  1.583119 2.600838 2.100947
H  2.520022 2.396289 0.616278
H  -3.690178 2.727613 -3.57171
H  -5.098247 1.775626 -4.088212
H  -3.568302 0.962405 -3.694395
totalener: -2001.95008195 hartree
nucrepener: 3954.36190388 hartree
electener: -5956.31198584 hartree
twoeener: 4653.94583949 hartree
kineticenergy: 1994.54001259 hartree
xcener: -168.601452235298 hartree
chargesum: 0.0000000
charge: 0.849650 -0.380114 -0.306551 -0.490489 -0.487556 -0.374695 -0.270465 -0.326348 -0.271036 -0.383348 0.146474 -0.294878 -0.016647 0.073451 -0.192829 0.272559 -0.092591 0.287843 -0.212240 -0.058815 0.154409 -0.281738 -0.067658 -0.038112 -0.290120 0.019361 0.201879 -0.231444 -0.026243 -0.246327 -0.109071 0.515029 -0.129189 0.138691 0.150085 0.098947 0.099200 0.125571 0.103817 0.100633 0.127612 0.123910 0.128734 0.132672 0.091578 0.106097 0.144786 0.084819 0.100287 0.078365 0.106363 0.084691 0.092031 0.106480 0.085273 0.102552 0.109055 0.078049 0.119804 0.121916 0.115828
qa: 0.8497 -0.3801 -0.3066 -0.4905 -0.4876 -0.3747 -0.2705 -0.3263 -0.2710 -0.3833 0.1465 -0.2949 -0.0166 0.0735 -0.1928 0.2726 -0.0926 0.2878 -0.2122 -0.0588 0.1544 -0.2817 -0.0677 -0.0381 -0.2901 0.0194 0.2019 -0.2314 -0.0262 -0.2463 -0.1091 0.5150 -0.1292 0.1387 0.1501 0.0989 0.0992 0.1256 0.1038 0.1006 0.1276 0.1239 0.1287 0.1327 0.0916 0.1061 0.1448 0.0848 0.1003 0.0784 0.1064 0.0847 0.0920 0.1065 0.0853 0.1026 0.1091 0.0780 0.1198 0.1219 0.1158
va: 5.5844 1.9918 2.0856 1.9960 1.9757 2.0885 2.1097 1.9448 2.1237 2.1022 3.3287 2.8910 3.7941 3.4068 3.8777 3.7187 3.3931 3.8254 3.9612 3.9302 4.1300 3.9202 3.8921 4.1211 3.8747 3.8630 3.8898 3.9128 3.9278 3.9781 3.9086 4.3335 3.8794 1.0129 1.0230 1.0057 1.0045 1.0094 1.0041 1.0105 1.0081 1.0120 1.0182 1.0171 0.9974 1.0057 1.0060 1.0117 1.0121 1.0168 1.0134 1.0059 1.0123 1.0082 1.0113 0.9931 1.0035 0.9864 0.9953 0.9952 0.9927
dispcorr: -0.039476942 hartree
energy: -2001.989558897032
dipole: -9.18023 7.08213 -2.09810 2.44241 -2.79517 -0.35276 5.40810 -5.18565 0.22245
magnitude: 2.13914 au
magnitude: 5.43727 debye
