program: Orca
programVersion: 5.0.2
elementType: S O O O O O O O O O N N C C C C C C C C C C C C C C C C C C C C C H H H H H H H H H H H H H H H H H H H H H H H H H H H H
charge: 0
multiplicity: 1
keywords: wb97x-d3
keywords: def2-TZVPP
keywords: def2/J RIJCOSX
keywords: DEFGRID2
keywords: scfconv7
keywords: smallprint printgap noloewdin
keywords: NOSOSCF
formula: C21H28N2O9S
InChI: InChI=1/C21H28N2O9S/c1-7-23-20(31-14(3)32-21(25)29-5)16(12-22-23)18(24)15-8-9-17(33(6,26)27)19(13(15)2)30-11-10-28-4/h8-9,12,14H,7,10-11H2,1-6H3
61 atoms
S  4.257413 0.008883 -1.875392
O  3.879448 -0.197514 1.095548
O  -4.124125 0.294705 1.707369
O  4.755813 -1.343704 -1.662444
O  3.972501 0.454005 -3.231694
O  -1.206401 1.387365 1.890154
O  -4.90632 1.54438 -0.047909
O  6.540196 -0.970494 1.740063
O  -4.958978 1.537606 -2.182526
O  -3.009576 2.02765 -1.185194
N  -3.827009 -1.648064 0.485764
N  -2.893036 -2.359586 -0.161574
C  1.514862 0.140461 1.147301
C  0.350661 0.383052 0.412962
C  2.747622 0.213982 -0.939407
C  2.714843 0.020184 0.440655
C  -1.979189 -0.475002 0.683157
C  -0.98833 0.510017 1.081086
C  0.389418 0.560506 -0.964748
C  1.591877 0.502529 -1.644684
C  -3.330972 -0.520397 1.009929
C  1.488797 0.01052 2.644224
C  -5.191737 -2.135291 0.518467
C  -1.790573 -1.663154 -0.059234
C  5.41877 1.169963 -1.175879
C  4.164924 -1.532403 1.499859
C  -4.278075 1.613858 1.221143
C  -5.865957 -2.0405 -0.838933
C  5.40601 -1.489406 2.368082
C  -5.189039 2.337288 2.175192
C  7.160071 -1.849346 0.835433
C  -4.168969 1.731818 -1.144183
C  -4.356836 1.679676 -3.463698
H  -0.525365 0.77585 -1.501788
H  1.632219 0.667631 -2.712065
H  0.879884 0.792181 3.090682
H  1.064734 -0.947225 2.953974
H  2.485906 0.089342 3.070158
H  -5.15695 -3.169707 0.861388
H  -5.734063 -1.558961 1.265498
H  -0.874088 -2.027795 -0.497165
H  6.286131 1.153687 -1.835302
H  4.977976 2.164325 -1.182164
H  5.703474 0.873874 -0.170863
H  3.341897 -1.947024 2.094028
H  4.294369 -2.1685 0.620684
H  -3.307962 2.104406 1.141399
H  -6.872647 -2.453557 -0.779494
H  -5.312122 -2.605135 -1.587499
H  -5.945715 -1.005501 -1.169719
H  5.583265 -2.507574 2.747767
H  5.210909 -0.853071 3.235453
H  -5.338344 3.362367 1.840447
H  -6.160548 1.848901 2.247301
H  -4.735442 2.367157 3.16427
H  6.55317 -2.051632 -0.05082
H  7.415494 -2.806019 1.309691
H  8.086446 -1.377055 0.509667
H  -5.150905 1.503039 -4.183467
H  -3.561359 0.949669 -3.614244
H  -3.950879 2.680886 -3.608016
totalener: -2001.95380613 hartree
nucrepener: 3866.72844128 hartree
electener: -5868.68224741 hartree
twoeener: 4565.97233423 hartree
kineticenergy: 1994.51635742 hartree
xcener: -168.594239440053 hartree
chargesum: -0.0000000
charge: 0.857666 -0.346762 -0.306644 -0.490678 -0.493349 -0.373411 -0.272247 -0.327254 -0.268130 -0.385071 0.146391 -0.293710 -0.037941 0.093004 -0.151411 0.246683 -0.138170 0.314508 -0.202234 -0.062263 0.157100 -0.311948 -0.064018 -0.038891 -0.304098 -0.075169 0.200697 -0.232583 0.050824 -0.244863 -0.131456 0.521698 -0.125832 0.136135 0.148776 0.130329 0.106153 0.102653 0.104227 0.099143 0.131081 0.128007 0.132453 0.142138 0.105037 0.131040 0.149290 0.084899 0.098470 0.079287 0.062228 0.080499 0.086196 0.091233 0.104395 0.113100 0.083921 0.105802 0.121637 0.113882 0.117549
qa: 0.8577 -0.3468 -0.3066 -0.4907 -0.4933 -0.3734 -0.2722 -0.3273 -0.2681 -0.3851 0.1464 -0.2937 -0.0379 0.0930 -0.1514 0.2467 -0.1382 0.3145 -0.2022 -0.0623 0.1571 -0.3119 -0.0640 -0.0389 -0.3041 -0.0752 0.2007 -0.2326 0.0508 -0.2449 -0.1315 0.5217 -0.1258 0.1361 0.1488 0.1303 0.1062 0.1027 0.1042 0.0991 0.1311 0.1280 0.1325 0.1421 0.1050 0.1310 0.1493 0.0849 0.0985 0.0793 0.0622 0.0805 0.0862 0.0912 0.1044 0.1131 0.0839 0.1058 0.1216 0.1139 0.1175
va: 5.5663 1.9709 2.0864 1.9584 1.9963 2.0939 2.1082 1.9643 2.1268 2.1056 3.3243 2.8940 3.8348 3.4292 3.9487 3.7737 3.4108 3.8250 3.9417 3.9205 4.1270 3.8952 3.8918 4.1132 3.8676 3.8361 3.8810 3.9117 3.9931 3.9810 3.8987 4.3240 3.8844 1.0171 1.0239 1.0178 0.9919 1.0087 1.0056 1.0092 1.0059 1.0187 1.0122 1.0248 0.9947 0.9995 1.0063 1.0113 1.0111 1.0181 1.0039 1.0017 1.0114 1.0127 1.0079 0.9895 0.9980 0.9940 0.9955 0.9916 0.9948
dispcorr: -0.036875781 hartree
energy: -2001.990681911050
dipole: 0.25289 -2.13310 -1.88021 -5.91960 6.00534 0.08574 7.30466 -6.55499 0.74966
magnitude: 2.02597 au
magnitude: 5.14960 debye
