program: Orca
programVersion: 5.0.2
elementType: S O O O O O O O O O N N C C C C C C C C C C C C C C C C C C C C C H H H H H H H H H H H H H H H H H H H H H H H H H H H H
charge: 0
multiplicity: 1
keywords: wb97x-d3
keywords: def2-TZVPP
keywords: def2/J RIJCOSX
keywords: DEFGRID2
keywords: scfconv7
keywords: smallprint printgap noloewdin
keywords: NOSOSCF
formula: C21H28N2O9S
InChI: InChI=1/C21H28N2O9S/c1-7-23-20(31-14(3)32-21(25)29-5)16(12-22-23)18(24)15-8-9-17(33(6,26)27)19(13(15)2)30-11-10-28-4/h8-9,12,14H,7,10-11H2,1-6H3
61 atoms
S  4.88423 -0.777314 1.185708
O  3.36185 0.069552 -1.21884
O  -4.05763 1.107476 1.557716
O  5.6928 0.276941 0.591824
O  5.142542 -1.196683 2.555075
O  -1.159989 2.11715 0.892541
O  -4.92918 1.04758 -0.55857
O  4.576091 0.327921 -3.749696
O  -5.106756 -0.224989 -2.265569
O  -3.0998 0.681624 -1.839594
N  -3.74069 -1.181289 1.723131
N  -2.784675 -2.120912 1.690186
C  1.264726 0.51716 -0.151332
C  0.534994 0.485224 1.038204
C  3.165082 -0.313064 1.100019
C  2.602483 0.117403 -0.10091
C  -1.879367 -0.086494 1.315673
C  -0.892513 0.946569 1.063803
C  1.102068 0.052213 2.229815
C  2.422633 -0.351827 2.268093
C  -3.252158 0.046417 1.505501
C  0.637061 0.929666 -1.45113
C  -5.111663 -1.578921 1.976392
C  -1.672991 -1.47912 1.442914
C  4.999254 -2.234452 0.157845
C  3.883014 1.308288 -1.698189
C  -4.225824 1.856658 0.370186
C  -5.661507 -2.456018 0.865943
C  5.034894 1.019072 -2.623351
C  -5.069308 3.05447 0.712551
C  5.606267 -0.034935 -4.61981
C  -4.256441 0.516779 -1.580623
C  -4.576222 -0.889847 -3.405945
H  0.506646 0.029798 3.133449
H  2.875035 -0.687545 3.190555
H  1.148579 0.474225 -2.2968
H  -0.41121 0.641265 -1.505616
H  0.671451 2.012758 -1.578571
H  -5.129802 -2.107071 2.93006
H  -5.70492 -0.674458 2.090096
H  -0.741121 -2.016785 1.360394
H  4.732579 -1.996578 -0.867479
H  6.035678 -2.566867 0.209802
H  4.347787 -3.007348 0.558597
H  3.103341 1.869582 -2.222995
H  4.24725 1.916721 -0.867441
H  -3.25561 2.147644 -0.031851
H  -5.052206 -3.348635 0.737766
H  -5.698476 -1.91753 -0.079867
H  -6.675474 -2.769059 1.113089
H  5.80204 0.450709 -2.080739
H  5.490377 1.982452 -2.902045
H  -4.552976 3.666393 1.449935
H  -5.229901 3.660809 -0.177178
H  -6.039009 2.761226 1.113764
H  6.142777 0.835593 -5.020757
H  5.164711 -0.576561 -5.45558
H  6.347207 -0.687742 -4.139728
H  -3.781609 -1.583268 -3.13121
H  -4.189793 -0.181895 -4.138944
H  -5.405967 -1.441247 -3.838298
totalener: -2001.95482130 hartree
nucrepener: 3845.07837369 hartree
electener: -5847.03319499 hartree
twoeener: 4544.42475970 hartree
kineticenergy: 1994.54990608 hartree
xcener: -168.597909970381 hartree
chargesum: 0.0000000
charge: 0.847628 -0.354366 -0.308599 -0.484178 -0.490808 -0.360927 -0.271810 -0.310950 -0.272005 -0.382940 0.146520 -0.294938 -0.022293 0.096943 -0.153019 0.213737 -0.148649 0.310844 -0.188295 -0.069268 0.161555 -0.281361 -0.067272 -0.034513 -0.300626 -0.021683 0.196732 -0.228491 0.016891 -0.244086 -0.111209 0.517748 -0.127914 0.130896 0.150578 0.112588 0.099870 0.114037 0.103428 0.100680 0.127938 0.134704 0.128759 0.127863 0.103921 0.114271 0.152664 0.100294 0.077582 0.083583 0.084675 0.074116 0.105174 0.084972 0.091546 0.077788 0.106642 0.077000 0.116127 0.118317 0.121590
qa: 0.8476 -0.3544 -0.3086 -0.4842 -0.4908 -0.3609 -0.2718 -0.3109 -0.2720 -0.3829 0.1465 -0.2949 -0.0223 0.0969 -0.1530 0.2137 -0.1486 0.3108 -0.1883 -0.0693 0.1616 -0.2814 -0.0673 -0.0345 -0.3006 -0.0217 0.1967 -0.2285 0.0169 -0.2441 -0.1112 0.5177 -0.1279 0.1309 0.1506 0.1126 0.0999 0.1140 0.1034 0.1007 0.1279 0.1347 0.1288 0.1279 0.1039 0.1143 0.1527 0.1003 0.0776 0.0836 0.0847 0.0741 0.1052 0.0850 0.0915 0.0778 0.1066 0.0770 0.1161 0.1183 0.1216
va: 5.5891 1.9896 2.0904 1.9718 1.9982 2.1137 2.1070 1.9618 2.1231 2.1012 3.3205 2.8872 3.8093 3.4762 3.9348 3.8237 3.4292 3.8768 3.9695 3.9423 4.1402 3.9074 3.8919 4.1110 3.8817 3.8881 3.8704 3.9143 3.9553 3.9774 3.9466 4.3253 3.8786 1.0059 1.0220 1.0067 1.0218 0.9962 1.0044 1.0106 1.0073 1.0122 1.0171 1.0140 1.0003 1.0045 1.0138 1.0124 1.0165 1.0117 1.0097 1.0012 1.0083 1.0117 1.0122 0.9895 0.9945 0.9905 0.9935 0.9959 0.9948
dispcorr: -0.035599540 hartree
energy: -2001.990420840013
dipole: -5.23004 3.03920 -2.19084 -3.40475 2.79436 -0.61039 -21.33276 19.80600 -1.52676
magnitude: 2.73922 au
magnitude: 6.96254 debye
