program: Orca
programVersion: 5.0.2
elementType: S O O O O O O O O O N N C C C C C C C C C C C C C C C C C C C C C H H H H H H H H H H H H H H H H H H H H H H H H H H H H
charge: 0
multiplicity: 1
keywords: wb97x-d3
keywords: def2-TZVPP
keywords: def2/J RIJCOSX
keywords: DEFGRID2
keywords: scfconv7
keywords: smallprint printgap noloewdin
keywords: NOSOSCF
formula: C21H28N2O9S
InChI: InChI=1/C21H28N2O9S/c1-7-23-20(31-14(3)32-21(25)29-5)16(12-22-23)18(24)15-8-9-17(33(6,26)27)19(13(15)2)30-11-10-28-4/h8-9,12,14H,7,10-11H2,1-6H3
61 atoms
S  3.321197 1.747811 -0.838285
O  2.545127 -1.022577 -0.043602
O  -2.128027 -0.93721 0.239306
O  3.273055 0.995234 -2.084079
O  3.30182 3.204161 -0.892103
O  -0.977049 0.768921 4.155222
O  -1.256373 0.392235 -1.271908
O  2.649475 -3.132544 -2.990121
O  0.107037 1.42861 -2.544387
O  -1.403307 2.636802 -1.395927
N  -3.649141 -1.899468 1.719606
N  -3.940237 -1.965673 3.025766
C  0.769724 -0.459211 1.450305
C  0.00342 0.554306 2.031235
C  1.996178 1.257192 0.255929
C  1.758764 -0.086335 0.535545
C  -2.168854 -0.606163 2.704299
C  -1.054218 0.26459 3.057497
C  0.242674 1.892993 1.738503
C  1.240347 2.253282 0.854009
C  -2.595079 -1.101805 1.479254
C  0.621659 -1.906185 1.825076
C  -4.413692 -2.699671 0.783717
C  -3.077161 -1.183354 3.619476
C  4.790332 1.264482 0.053037
C  1.976216 -1.678304 -1.181681
C  -2.32151 0.334833 -0.358554
C  -5.889381 -2.347472 0.799913
C  3.110614 -2.406634 -1.885506
C  -3.663456 0.412498 -1.049172
C  2.437667 -2.359057 -4.141221
C  -0.8921 1.598465 -1.709639
C  0.643101 2.604453 -3.148354
H  -0.349523 2.660759 2.21796
H  1.433258 3.293879 0.634985
H  0.210975 -2.027245 2.825042
H  -0.034969 -2.438641 1.135948
H  1.587708 -2.407941 1.80428
H  -3.984272 -2.551832 -0.20501
H  -4.270007 -3.748776 1.046245
H  -3.091301 -1.057175 4.6905
H  4.81235 1.772773 1.013907
H  4.807677 0.186508 0.184617
H  5.639152 1.581524 -0.552107
H  1.209197 -2.392759 -0.866547
H  1.506885 -0.942873 -1.837474
H  -2.226687 1.122574 0.395906
H  -6.427904 -2.986393 0.101038
H  -6.056284 -1.311568 0.505363
H  -6.31369 -2.49255 1.791258
H  3.563305 -3.125389 -1.197423
H  3.883668 -1.680831 -2.16925
H  -3.758218 -0.362415 -1.809975
H  -4.469055 0.295033 -0.323716
H  -3.791085 1.386735 -1.517998
H  2.16945 -3.041177 -4.947165
H  3.339871 -1.811035 -4.437756
H  1.628337 -1.628711 -4.031099
H  -0.115982 3.12446 -3.731979
H  1.442567 2.261645 -3.795557
H  1.05473 3.28465 -2.405034
totalener: -2001.94488060 hartree
nucrepener: 4141.34662125 hartree
electener: -6143.29150185 hartree
twoeener: 4839.56029004 hartree
kineticenergy: 1994.52622646 hartree
xcener: -168.598310849218 hartree
chargesum: -0.0000000
charge: 0.842178 -0.375613 -0.323745 -0.490784 -0.497124 -0.314124 -0.254183 -0.330447 -0.259603 -0.377568 0.152034 -0.297007 -0.033866 0.053840 -0.139395 0.227455 -0.163707 0.274068 -0.116165 -0.096476 0.206382 -0.316824 -0.096668 -0.045461 -0.284079 -0.018674 0.233491 -0.219277 0.052074 -0.295887 -0.101155 0.481481 -0.145468 0.123855 0.147305 0.117955 0.102338 0.125198 0.105096 0.111508 0.140156 0.133294 0.131680 0.132179 0.103599 0.100838 0.110438 0.085968 0.073483 0.108987 0.086202 0.067901 0.102067 0.094891 0.127050 0.107401 0.082900 0.077076 0.121994 0.130939 0.118002
qa: 0.8422 -0.3756 -0.3237 -0.4908 -0.4971 -0.3141 -0.2542 -0.3304 -0.2596 -0.3776 0.1520 -0.2970 -0.0339 0.0538 -0.1394 0.2275 -0.1637 0.2741 -0.1162 -0.0965 0.2064 -0.3168 -0.0967 -0.0455 -0.2841 -0.0187 0.2335 -0.2193 0.0521 -0.2959 -0.1012 0.4815 -0.1455 0.1239 0.1473 0.1180 0.1023 0.1252 0.1051 0.1115 0.1402 0.1333 0.1317 0.1322 0.1036 0.1008 0.1104 0.0860 0.0735 0.1090 0.0862 0.0679 0.1021 0.0949 0.1271 0.1074 0.0829 0.0771 0.1220 0.1309 0.1180
va: 5.5242 1.9686 2.0109 1.9577 1.9801 2.1717 2.1109 1.9895 2.1291 2.1080 3.2914 2.8728 3.7422 3.3916 3.7904 3.8613 3.4356 4.0048 3.9780 3.8766 4.0259 3.9248 3.9006 4.1305 3.8953 3.8051 3.9350 3.9138 3.9500 3.9514 3.9443 4.3771 3.8622 1.0175 1.0215 1.0002 0.9923 1.0063 1.0027 1.0029 1.0151 1.0104 1.0150 1.0154 1.0034 0.9890 1.0006 1.0096 1.0069 1.0131 0.9979 1.0162 1.0094 1.0062 1.0209 0.9919 0.9939 0.9828 0.9982 0.9964 1.0058
dispcorr: -0.043640699 hartree
energy: -2001.988521294733
dipole: -6.96983 6.35605 -0.61378 -14.29240 13.38312 -0.90928 -14.97760 14.11132 -0.86628
magnitude: 1.39784 au
magnitude: 3.55303 debye
