program: Orca
programVersion: 5.0.2
elementType: S O O O O O O O O O N N C C C C C C C C C C C C C C C C C C C C C H H H H H H H H H H H H H H H H H H H H H H H H H H H H
charge: 0
multiplicity: 1
keywords: wb97x-d3
keywords: def2-TZVPP
keywords: def2/J RIJCOSX
keywords: DEFGRID2
keywords: scfconv7
keywords: smallprint printgap noloewdin
keywords: NOSOSCF
formula: C21H28N2O9S
InChI: InChI=1/C21H28N2O9S/c1-7-23-20(31-14(3)32-21(25)29-5)16(12-22-23)18(24)15-8-9-17(33(6,26)27)19(13(15)2)30-11-10-28-4/h8-9,12,14H,7,10-11H2,1-6H3
61 atoms
S  4.425813 0.650976 -1.936956
O  4.039266 -0.388995 0.84642
O  -3.953165 -0.219752 1.547133
O  5.086102 -0.645112 -1.928483
O  4.106919 1.281317 -3.208883
O  -1.068541 0.853579 2.015421
O  -4.807634 1.470152 0.256686
O  4.995098 -1.897243 3.21199
O  -4.927492 2.033394 -1.799992
O  -2.947239 2.252897 -0.76903
N  -3.632189 -1.721641 -0.185921
N  -2.689241 -2.199508 -1.010432
C  1.673468 -0.089123 0.979628
C  0.507246 0.322789 0.328805
C  2.903186 0.549323 -1.009316
C  2.875962 -0.001552 0.271685
C  -1.804804 -0.619221 0.338898
C  -0.833142 0.23639 0.99788
C  0.542037 0.86175 -0.951635
C  1.744588 1.00155 -1.618002
C  -3.1532 -0.782935 0.640343
C  1.646777 -0.611382 2.388213
C  -4.986509 -2.226579 -0.293246
C  -1.599102 -1.540668 -0.713492
C  5.41809 1.807431 -1.003549
C  4.305902 -1.791355 0.862181
C  -4.130626 1.181357 1.46838
C  -5.646711 -1.813103 -1.596619
C  5.393442 -2.060955 1.878162
C  -5.003784 1.58711 2.623396
C  4.30726 -2.996815 3.737947
C  -4.105191 1.948861 -0.771826
C  -4.360773 2.513007 -3.013908
H  -0.37706 1.196903 -1.415292
H  1.783775 1.43824 -2.605989
H  1.182284 -1.599175 2.436141
H  2.645823 -0.686112 2.808876
H  1.066263 0.046008 3.030696
H  -4.936323 -3.312565 -0.213597
H  -5.547787 -1.858964 0.562841
H  -0.679598 -1.746152 -1.239776
H  5.614631 1.416785 -0.009792
H  6.35186 1.930227 -1.551193
H  4.897924 2.760752 -0.947337
H  3.39519 -2.352669 1.100474
H  4.643232 -2.109542 -0.12654
H  -3.16685 1.688751 1.49714
H  -6.646157 -2.242918 -1.655801
H  -5.073468 -2.169153 -2.450949
H  -5.741334 -0.73021 -1.665239
H  6.223488 -1.37241 1.702733
H  5.777817 -3.075645 1.698889
H  -5.966756 1.078093 2.595586
H  -4.505166 1.346757 3.560583
H  -5.1767 2.661479 2.598233
H  4.910356 -3.913455 3.70268
H  3.358978 -3.20163 3.224927
H  4.079833 -2.777497 4.780304
H  -3.979789 3.528215 -2.904706
H  -5.168238 2.505063 -3.740011
H  -3.553791 1.867735 -3.360947
totalener: -2001.95281816 hartree
nucrepener: 3864.20603419 hartree
electener: -5866.15885235 hartree
twoeener: 4563.41742001 hartree
kineticenergy: 1994.53285195 hartree
xcener: -168.597121659013 hartree
chargesum: -0.0000000
charge: 0.855626 -0.358728 -0.306531 -0.488842 -0.491409 -0.374602 -0.271103 -0.320281 -0.269099 -0.384921 0.146912 -0.294592 -0.027007 0.095030 -0.153971 0.236219 -0.138080 0.323492 -0.209749 -0.054258 0.158460 -0.332079 -0.064229 -0.040665 -0.295154 -0.042762 0.198628 -0.231479 0.040993 -0.245839 -0.117925 0.519739 -0.126981 0.136069 0.149265 0.102097 0.119365 0.131631 0.103598 0.099581 0.131288 0.131710 0.128212 0.127063 0.091435 0.131065 0.151055 0.084636 0.099412 0.078231 0.085526 0.068513 0.091367 0.104803 0.086083 0.088644 0.075396 0.114703 0.118545 0.121795 0.114098
qa: 0.8556 -0.3587 -0.3065 -0.4888 -0.4914 -0.3746 -0.2711 -0.3203 -0.2691 -0.3849 0.1469 -0.2946 -0.0270 0.0950 -0.1540 0.2362 -0.1381 0.3235 -0.2097 -0.0543 0.1585 -0.3321 -0.0642 -0.0407 -0.2952 -0.0428 0.1986 -0.2315 0.0410 -0.2458 -0.1179 0.5197 -0.1270 0.1361 0.1493 0.1021 0.1194 0.1316 0.1036 0.0996 0.1313 0.1317 0.1282 0.1271 0.0914 0.1311 0.1511 0.0846 0.0994 0.0782 0.0855 0.0685 0.0914 0.1048 0.0861 0.0886 0.0754 0.1147 0.1185 0.1218 0.1141
va: 5.5787 1.9685 2.0872 1.9701 1.9995 2.0926 2.1098 1.9688 2.1260 2.1047 3.3235 2.8923 3.7897 3.4296 3.9536 3.7964 3.4128 3.8193 3.9511 3.9298 4.1219 3.8803 3.8912 4.1140 3.8832 3.8132 3.8823 3.9127 3.9764 3.9800 3.9272 4.3271 3.8830 1.0163 1.0236 0.9923 1.0240 1.0191 1.0050 1.0098 1.0056 1.0163 1.0177 1.0118 0.9860 1.0227 1.0061 1.0113 1.0117 1.0175 1.0030 1.0038 1.0125 1.0080 1.0115 0.9978 0.9783 0.9934 0.9947 0.9955 0.9922
dispcorr: -0.036131976 hartree
energy: -2001.988950133714
dipole: -4.75197 2.84116 -1.91081 -9.14779 9.07765 -0.07014 10.65175 -9.91195 0.73980
magnitude: 2.05023 au
magnitude: 5.21127 debye
