program: Gaussian 09
title: 000006293
version: EM64L-G09RevD.01
frameworkgroup: C1[X(C14H8O4)]
method: RPBEPBE
basis: SDD
operation: Freq
keyword: #pfreq=noraman
keyword: PBEPBE/SDD
title: #p freq=noraman PBEPBE/SDD
converged: NO YES NO NO
title: Mulliken charges:
elementType: O O O O C C C C C C C C C C C C C C H H H H H H H H
charge: -0.444164 -0.322872 -0.193875 -0.407603 0.096849 0.343208 0.295320 0.268430 -0.029993 -0.268742 0.008875 -0.407672 -0.369436 -0.376928 0.153246 -0.329027 -0.226796 -0.220861 0.292049 0.291582 0.294922 0.265048 0.242886 0.242616 0.405661 0.397276
chargesum: 0.00000
title: Mulliken charges with hydrogens summed into heavy atoms:
elementType: O O O O C C C C C C C C C C C C C C
charge: -0.038503 -0.322872 -0.193875 -0.010327 0.096849 0.343208 0.295320 0.268430 -0.029993 -0.268742 0.008875 -0.115623 -0.077854 -0.082005 0.153246 -0.063979 0.016090 0.021755
polarizability: 2.95154539e+02 -2.30894828e+00 1.89835463e+02 -6.70513898e-03 -4.09902010e-04 6.10567397e+01
1716.lowfreq: -13.6078 -0.2229 -0.0011 -0.0008 -0.0008 4.4068 54.2629 97.4265 126.0820
frequency: 54.2600 97.4256 126.0820 155.6622 183.4023 186.5144 258.6467 268.3008 321.2210 322.8337 325.4928 383.2353 412.2030 419.1411 444.9763 463.3012 470.3460 494.4111 558.3490 565.6300 570.8381 601.2823 650.9939 669.4965 673.2019 720.9691 732.1119 742.7003 804.3686 817.1367 835.9556 872.5013 878.8102 935.4381 965.6327 979.2928 996.5691 998.5143 1016.9355 1021.8846 1042.0178 1085.9527 1150.0347 1168.9078 1177.1324 1196.1621 1208.8802 1260.1576 1293.2458 1300.9359 1324.7076 1354.7714 1395.9066 1420.1138 1442.1405 1447.6497 1468.0364 1473.6940 1532.9923 1550.9814 1580.3754 1596.8586 1609.7624 1622.2177 2656.2857 3139.6529 3154.2012 3162.2998 3164.8172 3174.4171 3180.6987 3479.5780
redmass: 7.5685 5.4361 6.6735 9.1738 6.2645 5.7772 5.9313 5.9969 6.7987 7.0112 6.2115 7.7791 11.8236 3.4047 5.2369 11.2009 6.9656 4.1098 1.1239 7.8901 4.5241 6.6113 6.8379 6.4386 4.8459 2.6823 5.5669 7.5916 1.6426 7.8096 2.0236 1.8442 7.4253 1.7502 1.0679 1.4021 4.9885 1.3989 1.3728 3.1944 2.0551 2.3697 1.7560 1.2743 1.2492 1.9298 2.6080 1.8254 2.3982 2.3152 4.6180 3.0924 8.5011 3.1705 4.3528 2.7843 5.4029 3.2849 7.9102 4.4298 6.6583 4.7286 7.0181 6.2993 1.0712 1.0864 1.0902 1.0890 1.0948 1.1003 1.0964 1.0646
irintensity: 3.3391 0.6486 1.3996 0.0154 0.0094 1.1668 0.0022 3.3654 2.1163 7.3180 1.3073 8.3300 18.3518 1.2469 0.6228 0.1967 14.4628 5.6195 158.2757 5.8333 4.6676 21.0353 14.2328 4.2551 2.4850 55.1917 15.0379 6.6636 26.2828 25.7033 19.9999 24.6084 3.7164 3.2301 137.0331 1.4778 32.0013 6.5346 0.3501 19.5781 3.3236 0.5368 16.5457 121.4429 134.8489 39.9110 61.3751 12.2563 100.0562 485.9742 290.7001 182.1527 2.8328 132.1957 7.5884 13.2035 225.2615 80.2433 151.7321 109.5180 4.1305 4.2792 8.4482 9.5351 211.0263 3.7067 5.6501 0.1336 1.8171 28.4408 4.2771 123.1006
temp: 298.150 k
press: 1.00000 atm
elementType: 8 8 8 8 6 6 6 6 6 6 6 6 6 6 6 6 6 6 1 1 1 1 1 1 1 1
symmnumber: 1
zpe: 483361.0 jmol-1
zpe.correction: 0.184102 hartree
zpe.thermalcorrener: 0.197269 hartree
zpe.thermalcorrenthalpy: 0.198214 hartree
zpe.thermalcorrgfe: 0.144704 hartree
zpe.sumelectzpe: -837.998254 hartree
zpe.sumelectthermal: -837.985087 hartree
zpe.sumelectthermalent: -837.984143 hartree
zpe.sumelectthermalfe: -838.037653 hartree
dipole: -1.9197 -1.4185 0.0033
dipole: 2.3869
quadrupole: -86.5223 -107.8544 -105.1623
quadrupole: 4.7817 -0.0094 -0.0169
quadrupole: 13.3240 -8.0081 -5.3159 4.7817 -0.0094 -0.0169
hfenergy: -838.1823562 hartree
pointgroup: C01 [X(C14H8O4)]
dipole: -0.7702312 0.5372128 -0.0010821 debye
dipolederiv: -0.6078076 -0.0986883 0.0003278 -0.5414645 -1.1280465 0.0002781 0.0000591 0.0002507 -0.3857826 -0.6561295 -0.1027571 -0.0001883 0.0872186 -1.0147182 -0.0012956 0.0002592 0.0000102 -0.341248 -0.7040567 -0.0693959 0.0001628 -0.3599495 -0.9634142 0.0010446 -0.0008532 -0.0010161 -0.3096109 -1.5392228 -0.506488 0.0005366 -0.698117 -0.3756644 0.0005072 0.0009541 0.0005994 -0.3935962 -0.815081 0.2869485 0.0004498 0.6346346 -0.2679461 -0.0003193 0.0012737 0.000108 -0.0215757 -1.0375482 -0.2144801 0.0002929 -0.4043107 -0.0028011 0.0000891 0.000149 -0.0001184 0.0345108 -0.6256492 -0.1734278 -0.0005218 -0.3087781 -0.0461861 -0.0003034 -0.0005371 0.0004982 -0.0003023 -0.1988066 0.2410395 0.000002 0.4312093 -0.1846312 0.0000871 -0.0004952 -0.0001882 0.0392072 1.7200091 -0.0501267 0.0002565 -0.2820399 1.0001344 0.0016155 -0.000128 0.0001495 0.1583619 1.7292508 -0.0079511 -0.0001812 0.2151477 0.9644816 -0.0007488 0.0010142 0.0006487 0.1049909 -0.1816117 -0.3025925 -0.0000097 0.8345693 0.9992044 -0.0006112 0.0005467 -0.0002967 0.0772096 0.140955 0.1688855 -0.0001352 0.0361799 0.0703285 -0.0000204 -0.000018 -0.0000308 -0.1167923 -0.1135059 0.1936117 0.0001421 -0.0817591 0.0690032 0.0000095 -0.0004023 0.0001203 -0.1012198 -0.3224178 -0.0472336 -0.0000689 0.1809998 0.0939982 0.0000755 -0.0004035 0.0001131 -0.1066356 1.6466518 0.6902472 -0.0009429 0.4341177 0.0640597 -0.0002931 -0.0012026 -0.0005364 0.0754677 0.0003585 -0.1222677 -0.0002098 -0.3551074 -0.0994959 0.0003169 -0.0002349 0.0001859 -0.1535536 0.1274225 -0.1913126 0.0002018 -0.0954529 -0.0356556 -0.0001439 0.0002308 -0.0002401 -0.1419925 0.2460486 0.0935332 0.0003908 -0.032953 -0.0185607 0.0001181 0.0004988 0.0001753 -0.1313481 0.1138298 -0.0481923 0.0000259 0.0105159 0.0132144 -0.0000436 0.0000589 -0.0000301 0.1563883 0.1231945 -0.0512193 -0.0000672 0.0063251 0.0059687 -0.0000125 0.0001161 -0.0000379 0.1566845 0.1407742 0.0182129 -0.000033 -0.0532319 0.0106789 -0.0000715 -0.000078 -0.0000402 0.1565255 -0.0104337 0.0629057 0.0001463 0.0701289 0.0661667 -0.0000916 0.0000698 -0.0001651 0.170826 -0.046852 0.0889717 -0.0001446 0.1098295 0.0211216 0.0000679 -0.0001975 0.0001312 0.1582819 -0.1004901 -0.05389 -0.0002395 -0.0670352 0.0739793 -0.0000934 -0.0002841 -0.0001418 0.1559229 0.4834588 0.0651206 -0.0002624 0.0227035 0.4346102 0.0000201 -0.0004403 0.0000182 0.3672309 0.4876591 0.1305465 0.0000692 0.2066194 0.2501701 -0.0001813 0.0000443 -0.000167 0.3920493 unknown
polarizability: 294.9496474|5.183457|190.0403466|-0.0118828|0.0309016|61.0567476 unknown
InChI: InChI=1S/C14H8O4/c15-10-6-5-9-11(14(10)18)13(17)8-4-2-1-3-7(8)12(9)16/h1-6,15,18H
charge 0 multiplicity 1
26 atoms
O  2.511299 2.185776 0.000066
O  0.019401 2.546784 0.003186
O  -0.896179 -2.911292 -0.000114
O  4.626505 0.48247 -0.001505
C  0.904344 0.319869 0.001909
C  0.700911 -1.099367 0.001559
C  -1.591421 0.735576 0.001931
C  -1.815195 -0.675689 0.001374
C  -0.212617 1.267056 0.003595
C  -0.67552 -1.655934 0.002813
C  2.22678 0.836286 0.000703
C  1.822235 -1.957431 0.000286
C  -2.691597 1.629626 0.001037
C  -3.142432 -1.166185 -0.000136
C  3.347761 -0.049331 -0.000409
C  3.139278 -1.440642 -0.000572
C  -4.007692 1.128356 -0.000475
C  -4.232698 -0.271983 -0.001078
H  1.646095 -3.036986 0.000149
H  -2.488148 2.704777 0.00155
H  -3.289456 -2.250728 -0.000453
H  4.009807 -2.102305 -0.001489
H  -4.857259 1.818997 -0.001186
H  -5.256966 -0.659443 -0.002231
H  1.589035 2.676836 -0.000422
H  4.55993 1.477008 -0.001186
