program: Orca
programVersion: 5.0.2
elementType: Cl S F F F O O O O O O C C C C C C C C C C C C C C C C C H H H H H H H H H H H H H H H H
charge: 0
multiplicity: 1
keywords: wb97x-d3
keywords: def2-TZVPP
keywords: def2/J RIJCOSX
keywords: DEFGRID2
keywords: scfconv7
keywords: smallprint printgap noloewdin
keywords: NOSOSCF
formula: C17H16ClF3O6S
InChI: InChI=1/C17H16ClF3O6S/c1-28(25,26)13-6-5-9(15(18)10(13)7-27-8-17(19,20)21)16(24)14-11(22)3-2-4-12(14)23/h3,5-6,22-23H,2,4,7-8H2,1H3
44 atoms
Cl 1.098499 -0.994706 -1.643761
S  -3.163874 1.689779 0.704951
F  -3.006692 -3.344864 -2.097218
F  -4.454517 -4.225732 -0.772549
F  -2.37514 -4.127834 -0.195968
O  5.407968 1.500904 -1.221647
O  2.236024 -0.259151 1.771795
O  2.992698 1.667248 -1.766702
O  -2.449707 -1.398428 0.089608
O  -3.314685 3.119304 0.982825
O  -4.04216 1.123786 -0.316344
C  3.726809 0.864518 0.309752
C  5.744669 0.908694 2.328678
C  6.155943 0.690792 0.879056
C  4.40473 0.289492 2.592386
C  5.053189 1.045405 -0.054639
C  3.469322 0.285043 1.637447
C  2.720417 1.256225 -0.625013
C  1.269701 1.268861 -0.256468
C  -0.979981 0.348107 -0.498087
C  -1.437468 1.426211 0.275429
C  0.392032 0.306307 -0.7410
C  0.779459 2.310397 0.505422
C  -0.575477 2.39246 0.769563
C  -1.894529 -0.725513 -1.0258
C  -3.379473 0.827113 2.238943
C  -3.626318 -2.11682 -0.151492
C  -3.358438 -3.457719 -0.806628
H  5.735621 1.981912 2.552122
H  6.499743 0.470011 2.98002
H  6.384177 -0.369461 0.713185
H  7.053443 1.254094 0.622228
H  4.200458 -0.150922 3.561647
H  1.451092 3.063887 0.894815
H  -0.940899 3.216827 1.364299
H  -2.670858 -0.283727 -1.653943
H  -1.332958 -1.413615 -1.655966
H  -3.190892 -0.233854 2.108081
H  -4.410242 0.990403 2.556762
H  -2.696392 1.244222 2.976571
H  -4.093169 -2.301407 0.818259
H  -4.341257 -1.564121 -0.770112
H  4.564934 1.663456 -1.743974
H  2.114916 -0.566699 2.679366
elementType: Cl S F O C H
totalener: -2266.90071576 hartree
nucrepener: 3198.46838912 hartree
electener: -5465.36910488 hartree
oneelecener: -9484.14462077 hartree
twoeener: 4018.77551589 hartree
cpcmener: -0.05297096 hartree
kineticenergy: 2259.88580322 hartree
xcener: -166.573300362234 hartree
chargesum: -0.0000000
charge: -0.065803 0.885674 -0.187436 -0.184510 -0.185261 -0.329967 -0.370698 -0.479838 -0.363592 -0.575228 -0.556136 -0.154448 -0.083200 -0.112784 -0.252045 0.303747 0.148359 0.326814 0.072490 -0.038151 -0.030605 0.053413 -0.146240 -0.088994 -0.061357 -0.257225 -0.001678 0.498028 0.076746 0.085898 0.107036 0.094399 0.128046 0.156807 0.149085 0.146499 0.105309 0.142244 0.141901 0.145092 0.126539 0.112868 0.272660 0.245540
qa: -0.0658 0.8857 -0.1874 -0.1845 -0.1853 -0.3300 -0.3707 -0.4798 -0.3636 -0.5752 -0.5561 -0.1544 -0.0832 -0.1128 -0.2520 0.3037 0.1484 0.3268 0.0725 -0.0382 -0.0306 0.0534 -0.1462 -0.0890 -0.0614 -0.2572 -0.0017 0.4980 0.0767 0.0859 0.1070 0.0944 0.1280 0.1568 0.1491 0.1465 0.1053 0.1422 0.1419 0.1451 0.1265 0.1129 0.2727 0.2455
va: 1.2775 5.4879 1.1067 1.1192 1.1139 2.2278 2.0891 2.0226 1.9267 1.8976 1.8943 3.4892 3.9197 3.9636 3.8325 3.9142 3.8505 3.8352 3.6477 3.7958 3.7389 3.9175 4.0184 3.9581 3.9335 3.8634 3.8910 4.4009 1.0036 1.0070 1.0076 1.0236 1.0059 0.9967 1.0181 0.9945 1.0250 1.0110 1.0107 1.0072 1.0007 1.0143 1.0559 0.9934
dispcorr: -0.025898744 hartree
energy: -2266.926614507820
dipole: 21.18156 -19.28340 1.89816 19.00462 -19.56352 -0.55890 21.77393 -18.23212 3.54181
magnitude: 4.05707 au
magnitude: 10.31224 debye
