program: Orca
programVersion: 5.0.2
elementType: Cl S F F F O O O O O O C C C C C C C C C C C C C C C C C H H H H H H H H H H H H H H H H
charge: 0
multiplicity: 1
keywords: wb97x-d3
keywords: def2-TZVPP
keywords: def2/J RIJCOSX
keywords: DEFGRID2
keywords: scfconv7
keywords: smallprint printgap noloewdin
keywords: NOSOSCF
formula: C17H16ClF3O6S
InChI: InChI=1/C17H16ClF3O6S/c1-28(25,26)13-6-5-9(15(18)10(13)7-27-8-17(19,20)21)16(24)14-11(22)3-2-4-12(14)23/h3,5-6,22-23H,2,4,7-8H2,1H3
44 atoms
Cl 1.064631 -0.904303 -1.666316
S  -3.188802 1.717909 0.765377
F  -2.267361 -4.113373 -0.182699
F  -2.910073 -3.334788 -2.082163
F  -4.339751 -4.260535 -0.769831
O  5.362776 1.429538 -1.299897
O  2.17344 -0.229827 1.742736
O  2.954933 1.79305 -1.748333
O  -2.412639 -1.380141 0.095125
O  -3.354527 3.141822 1.058364
O  -4.081053 1.146195 -0.240005
C  3.691985 0.833821 0.259754
C  5.785863 0.62598 2.196785
C  6.121081 0.449742 0.722711
C  4.409624 0.106365 2.4871
C  5.015886 0.938999 -0.145323
C  3.441437 0.216559 1.571999
C  2.685701 1.320725 -0.62912
C  1.237329 1.341307 -0.250028
C  -1.010222 0.416113 -0.490458
C  -1.46714 1.480241 0.302367
C  0.359677 0.382892 -0.742127
C  0.748322 2.373589 0.525191
C  -0.605203 2.445279 0.800749
C  -1.920314 -0.659026 -1.01983
C  -3.357263 0.833421 2.294339
C  -3.569056 -2.135255 -0.130359
C  -3.264399 -3.464077 -0.794457
H  5.875427 1.683215 2.472181
H  6.525311 0.092897 2.793684
H  6.252781 -0.615861 0.496816
H  7.051958 0.949899 0.454481
H  4.204696 -0.355004 3.446566
H  1.419597 3.125096 0.91915
H  -0.972343 3.25938 1.409091
H  -2.732272 -0.217492 -1.599275
H  -1.36972 -1.310479 -1.695798
H  -3.142506 -0.220308 2.145681
H  -4.38665 0.964377 2.630201
H  -2.673331 1.259077 3.026374
H  -4.016836 -2.339437 0.844487
H  -4.310628 -1.603386 -0.736156
H  4.514713 1.681519 -1.780127
H  2.072575 -0.580611 2.636708
elementType: Cl S F O C H
totalener: -2266.90073157 hartree
nucrepener: 3202.62861020 hartree
electener: -5469.52934178 hartree
oneelecener: -9492.48102274 hartree
twoeener: 4022.95168097 hartree
cpcmener: -0.05289958 hartree
kineticenergy: 2259.88741331 hartree
xcener: -166.573567487650 hartree
chargesum: -0.0000000
charge: -0.067183 0.884231 -0.185674 -0.186914 -0.184504 -0.330500 -0.368641 -0.481285 -0.362148 -0.573787 -0.555776 -0.161929 -0.080214 -0.115300 -0.255057 0.304785 0.156022 0.338659 0.085332 -0.042643 -0.029646 0.043733 -0.144110 -0.093814 -0.065586 -0.257128 -0.000418 0.497069 0.076457 0.085694 0.107173 0.094150 0.127802 0.155775 0.148904 0.146931 0.105844 0.141351 0.142139 0.145302 0.126706 0.112282 0.272949 0.242967
qa: -0.0672 0.8842 -0.1857 -0.1869 -0.1845 -0.3305 -0.3686 -0.4813 -0.3621 -0.5738 -0.5558 -0.1619 -0.0802 -0.1153 -0.2551 0.3048 0.1560 0.3387 0.0853 -0.0426 -0.0296 0.0437 -0.1441 -0.0938 -0.0656 -0.2571 -0.0004 0.4971 0.0765 0.0857 0.1072 0.0941 0.1278 0.1558 0.1489 0.1469 0.1058 0.1414 0.1421 0.1453 0.1267 0.1123 0.2729 0.2430
va: 1.2756 5.4895 1.1133 1.1075 1.1192 2.2269 2.0914 2.0223 1.9276 1.8992 1.8948 3.4981 3.9184 3.9672 3.8354 3.9131 3.8412 3.8199 3.6485 3.7988 3.7414 3.9256 4.0223 3.9587 3.9432 3.8635 3.8914 4.4035 1.0037 1.0067 1.0074 1.0236 1.0063 0.9978 1.0180 0.9950 1.0237 1.0115 1.0105 1.0070 1.0009 1.0137 1.0567 0.9954
dispcorr: -0.025917691 hartree
energy: -2266.926649263539
dipole: 20.93719 -19.00052 1.93666 17.74031 -18.47723 -0.73692 21.33692 -17.88972 3.44720
magnitude: 4.02205 au
magnitude: 10.22324 debye
