program: Orca
programVersion: 5.0.2
elementType: Cl S F F F O O O O O O C C C C C C C C C C C C C C C C C H H H H H H H H H H H H H H H H
charge: 0
multiplicity: 1
keywords: wb97x-d3
keywords: def2-TZVPP
keywords: def2/J RIJCOSX
keywords: DEFGRID2
keywords: scfconv7
keywords: smallprint printgap noloewdin
keywords: NOSOSCF
formula: C17H16ClF3O6S
InChI: InChI=1/C17H16ClF3O6S/c1-28(25,26)13-6-5-9(15(18)10(13)7-27-8-17(19,20)21)16(24)14-11(22)3-2-4-12(14)23/h3,5-6,22-23H,2,4,7-8H2,1H3
44 atoms
Cl 1.481477 -1.46712 -0.945632
S  -2.94901 0.860106 1.470961
F  -5.278508 -1.189458 -1.369753
F  -5.18675 -3.164658 -2.222177
F  -4.012869 -1.563322 -3.065428
O  5.288862 1.583665 -1.505962
O  2.796546 -0.200162 2.072319
O  2.824219 1.54871 -1.641802
O  -2.510196 -1.336474 -0.820386
O  -3.434492 -0.470939 1.826543
O  -3.022965 1.887014 2.511393
C  3.945052 0.893755 0.308757
C  6.285727 1.139021 1.942767
C  6.445288 0.901994 0.448009
C  5.046678 0.470666 2.457187
C  5.174498 1.152282 -0.283789
C  3.959451 0.375622 1.685181
C  2.772225 1.139089 -0.467329
C  1.391233 0.979495 0.089843
C  -0.670669 -0.317004 0.27126
C  -1.239233 0.792737 0.917212
C  0.654159 -0.176724 -0.136964
C  0.799528 2.044031 0.73836
C  -0.517309 1.952037 1.152232
C  -1.422865 -1.599646 0.039357
C  -3.823573 1.47904 0.057432
C  -3.315427 -2.468492 -0.998227
C  -4.450834 -2.08997 -1.916683
H  6.263708 2.216181 2.144763
H  7.165812 0.753426 2.456505
H  6.713052 -0.145908 0.263647
H  7.242807 1.512534 0.024013
H  5.033962 0.080426 3.468568
H  1.361814 2.949711 0.922338
H  -0.966388 2.797486 1.652454
H  -0.771141 -2.353984 -0.405119
H  -1.760074 -2.007726 0.995861
H  -4.882858 1.499976 0.314094
H  -3.651931 0.842908 -0.802956
H  -3.473959 2.48847 -0.149368
H  -2.757533 -3.294806 -1.455623
H  -3.731821 -2.83447 -0.052028
H  4.354858 1.668529 -1.876664
H  2.863829 -0.467703 2.997911
elementType: Cl S F O C H
totalener: -2266.90124728 hartree
nucrepener: 3186.83958138 hartree
electener: -5453.74082866 hartree
oneelecener: -9461.11947935 hartree
twoeener: 4007.37865069 hartree
cpcmener: -0.05119973 hartree
kineticenergy: 2259.89474058 hartree
xcener: -166.575906400720 hartree
chargesum: 0.0000000
charge: -0.065498 0.886493 -0.184137 -0.182334 -0.186846 -0.331490 -0.366481 -0.481829 -0.353972 -0.559112 -0.573659 -0.164382 -0.081212 -0.114281 -0.255280 0.302228 0.159608 0.344320 0.062951 -0.062412 -0.018241 0.072704 -0.133952 -0.110649 -0.046783 -0.264009 -0.024295 0.510142 0.076247 0.085458 0.107196 0.095092 0.127520 0.154524 0.149582 0.111123 0.137051 0.143436 0.130339 0.149046 0.123187 0.117390 0.272883 0.242332
qa: -0.0655 0.8865 -0.1841 -0.1823 -0.1868 -0.3315 -0.3665 -0.4818 -0.3540 -0.5591 -0.5737 -0.1644 -0.0812 -0.1143 -0.2553 0.3022 0.1596 0.3443 0.0630 -0.0624 -0.0182 0.0727 -0.1340 -0.1106 -0.0468 -0.2640 -0.0243 0.5101 0.0762 0.0855 0.1072 0.0951 0.1275 0.1545 0.1496 0.1111 0.1371 0.1434 0.1303 0.1490 0.1232 0.1174 0.2729 0.2423
va: 1.2801 5.4890 1.1097 1.1228 1.1126 2.2257 2.0951 2.0233 1.9412 1.8921 1.9004 3.5019 3.9174 3.9672 3.8354 3.9187 3.8410 3.8169 3.6787 3.8606 3.7225 3.8728 4.0256 3.9751 3.9170 3.8595 3.9076 4.3890 1.0032 1.0066 1.0070 1.0234 1.0065 0.9989 1.0185 1.0186 0.9949 1.0100 1.0264 1.0085 1.0045 1.0064 1.0579 0.9955
dispcorr: -0.025763640 hartree
energy: -2266.927010920162
dipole: 29.72238 -26.89270 2.82968 12.89424 -13.14081 -0.24657 16.96904 -16.23028 0.73876
magnitude: 2.93490 au
magnitude: 7.45993 debye
