program: Orca
programVersion: 5.0.2
elementType: Cl S F F F O O O O O O C C C C C C C C C C C C C C C C C H H H H H H H H H H H H H H H H
charge: 0
multiplicity: 1
keywords: wb97x-d3
keywords: def2-TZVPP
keywords: def2/J RIJCOSX
keywords: DEFGRID2
keywords: scfconv7
keywords: smallprint printgap noloewdin
keywords: NOSOSCF
formula: C17H16ClF3O6S
InChI: InChI=1/C17H16ClF3O6S/c1-28(25,26)13-6-5-9(15(18)10(13)7-27-8-17(19,20)21)16(24)14-11(22)3-2-4-12(14)23/h3,5-6,22-23H,2,4,7-8H2,1H3
44 atoms
Cl 1.170023 -0.071722 -2.073117
S  -3.721625 1.520611 -0.001191
F  -2.946702 -3.195388 0.779304
F  -1.633709 -1.591423 1.345585
F  -0.843702 -3.579485 1.063802
O  5.065672 1.871316 -0.144011
O  1.558815 -0.861584 1.388185
O  2.736581 2.74163 -0.153274
O  -2.397658 -1.474305 -1.3461
O  -4.035968 2.613008 0.919933
O  -4.160076 1.669456 -1.388429
C  3.209134 0.509683 0.383301
C  4.925575 -1.740466 0.024092
C  5.540737 -0.393918 0.381205
C  3.580707 -1.894189 0.669067
C  4.565513 0.714647 0.190786
C  2.785899 -0.830186 0.815333
C  2.323142 1.597978 0.107758
C  0.835066 1.434354 0.102793
C  -1.214706 0.605699 -0.944629
C  -1.930249 1.326215 0.025839
C  0.174699 0.705383 -0.881314
C  0.091112 2.105076 1.053433
C  -1.290699 2.055144 1.014697
C  -1.883176 -0.303255 -1.95163
C  -4.425916 0.046542 0.683978
C  -1.452461 -2.402717 -0.875007
C  -1.72236 -2.689043 0.584169
H  5.596244 -2.533778 0.352253
H  4.851961 -1.833633 -1.065602
H  6.441815 -0.194378 -0.199258
H  5.83356 -0.386025 1.438275
H  3.256962 -2.871537 1.008624
H  0.585056 2.676297 1.827845
H  -1.852677 2.600652 1.757901
H  -2.730324 0.190816 -2.416614
H  -1.193565 -0.557681 -2.756255
H  -4.006725 -0.130454 1.671471
H  -4.254343 -0.799604 0.028308
H  -5.496663 0.234509 0.771049
H  -1.534093 -3.339666 -1.434002
H  -0.418576 -2.061101 -0.969386
H  4.300812 2.51822 -0.201592
H  1.3237 -1.775157 1.592527
elementType: Cl S F O C H
totalener: -2266.89888046 hartree
nucrepener: 3362.74748574 hartree
electener: -5629.64636620 hartree
oneelecener: -9811.38335809 hartree
twoeener: 4181.73699189 hartree
cpcmener: -0.04941761 hartree
kineticenergy: 2259.89227100 hartree
xcener: -166.577330037912 hartree
chargesum: -0.0000000
charge: -0.064998 0.869333 -0.188789 -0.186425 -0.189367 -0.332044 -0.370816 -0.486634 -0.359421 -0.566897 -0.557373 -0.186149 -0.083301 -0.114546 -0.235295 0.301130 0.142861 0.379287 0.108141 -0.096731 -0.020038 0.016808 -0.129188 -0.102967 -0.043093 -0.271536 -0.026923 0.530523 0.086205 0.074288 0.094089 0.105885 0.125963 0.153676 0.153026 0.152081 0.126722 0.141705 0.139067 0.154484 0.138139 0.103460 0.271706 0.243951
qa: -0.0650 0.8693 -0.1888 -0.1864 -0.1894 -0.3320 -0.3708 -0.4866 -0.3594 -0.5669 -0.5574 -0.1861 -0.0833 -0.1145 -0.2353 0.3011 0.1429 0.3793 0.1081 -0.0967 -0.0200 0.0168 -0.1292 -0.1030 -0.0431 -0.2715 -0.0269 0.5305 0.0862 0.0743 0.0941 0.1059 0.1260 0.1537 0.1530 0.1521 0.1267 0.1417 0.1391 0.1545 0.1381 0.1035 0.2717 0.2440
va: 1.2787 5.5067 1.1112 1.0998 1.1164 2.2251 2.0937 2.0207 1.9350 1.9028 1.8986 3.4660 3.9204 3.9649 3.8343 3.9339 3.8293 3.7829 3.5923 3.6581 3.6878 3.9268 4.0261 3.9646 3.8409 3.8567 3.9461 4.3047 1.0070 1.0044 1.0233 1.0084 1.0061 1.0033 1.0171 1.0084 1.0059 1.0092 1.0271 1.0128 1.0090 1.0165 1.0554 1.0002
dispcorr: -0.029587552 hartree
energy: -2266.928468011764
dipole: 14.09072 -11.73548 2.35524 0.29687 -3.82565 -3.52878 1.29749 -0.65359 0.64389
magnitude: 4.29115 au
magnitude: 10.90724 debye
