program: Orca
programVersion: 5.0.2
elementType: Cl S F F F O O O O O O C C C C C C C C C C C C C C C C C H H H H H H H H H H H H H H H H
charge: 0
multiplicity: 1
keywords: wb97x-d3
keywords: def2-TZVPP
keywords: def2/J RIJCOSX
keywords: DEFGRID2
keywords: scfconv7
keywords: smallprint printgap noloewdin
keywords: NOSOSCF
formula: C17H16ClF3O6S
InChI: InChI=1/C17H16ClF3O6S/c1-28(25,26)13-6-5-9(15(18)10(13)7-27-8-17(19,20)21)16(24)14-11(22)3-2-4-12(14)23/h3,5-6,22-23H,2,4,7-8H2,1H3
44 atoms
Cl 1.059174 -1.868011 0.605776
S  -3.141945 1.749847 0.918395
F  -2.566371 -3.369774 -2.979257
F  -3.76798 -1.663899 -2.431527
F  -4.057887 -3.540506 -1.429632
O  5.155101 0.062761 -1.455961
O  2.367871 1.057468 2.204894
O  2.698944 -0.139064 -1.710637
O  -2.736052 -1.71163 0.127877
O  -3.467439 1.203513 2.235678
O  -3.1626 3.206484 0.777802
C  3.658974 0.742101 0.238718
C  5.843874 2.168701 1.392171
C  6.134757 0.96122 0.511109
C  4.568561 1.966632 2.153972
C  4.935554 0.575574 -0.280186
C  3.553025 1.300308 1.595997
C  2.554513 0.379061 -0.588566
C  1.145476 0.672351 -0.180055
C  -1.01271 -0.096476 0.668363
C  -1.494557 1.204513 0.442849
C  0.323335 -0.318769 0.342054
C  0.625467 1.929031 -0.411676
C  -0.694002 2.199184 -0.093532
C  -1.88844 -1.231226 1.15146
C  -4.252174 1.08848 -0.291632
C  -2.074017 -2.348041 -0.932793
C  -3.124847 -2.732021 -1.944099
H  5.795474 3.072832 0.774427
H  6.676268 2.313729 2.079804
H  6.393684 0.099056 1.137901
H  6.978785 1.13738 -0.155681
H  4.474579 2.368599 3.156437
H  1.249711 2.710295 -0.82439
H  -1.078333 3.193064 -0.266856
H  -1.277162 -2.040483 1.554107
H  -2.539876 -0.903879 1.955545
H  -3.932242 1.402528 -1.283006
H  -5.235243 1.506105 -0.072217
H  -4.286253 0.007115 -0.22445
H  -1.349055 -1.696898 -1.43494
H  -1.549219 -3.253069 -0.605834
H  4.257234 -0.165669 -1.850302
H  2.343758 1.509423 3.058001
elementType: Cl S F O C H
totalener: -2266.90045563 hartree
nucrepener: 3222.84950522 hartree
electener: -5489.74996085 hartree
oneelecener: -9532.07385324 hartree
twoeener: 4042.32389239 hartree
cpcmener: -0.04975598 hartree
kineticenergy: 2259.90497170 hartree
xcener: -166.578777722190 hartree
chargesum: -0.0000000
charge: -0.061748 0.867232 -0.182628 -0.182542 -0.185170 -0.330298 -0.368454 -0.482471 -0.351601 -0.558175 -0.566286 -0.161806 -0.081405 -0.113544 -0.251691 0.303213 0.146112 0.335234 0.106962 -0.114018 -0.021394 0.034899 -0.132722 -0.092227 -0.046090 -0.262871 -0.020828 0.493494 0.076238 0.085817 0.107070 0.094377 0.128289 0.155873 0.155990 0.126683 0.153170 0.145154 0.144949 0.142351 0.118971 0.127514 0.273410 0.244968
qa: -0.0617 0.8672 -0.1826 -0.1825 -0.1852 -0.3303 -0.3685 -0.4825 -0.3516 -0.5582 -0.5663 -0.1618 -0.0814 -0.1135 -0.2517 0.3032 0.1461 0.3352 0.1070 -0.1140 -0.0214 0.0349 -0.1327 -0.0922 -0.0461 -0.2629 -0.0208 0.4935 0.0762 0.0858 0.1071 0.0944 0.1283 0.1559 0.1560 0.1267 0.1532 0.1452 0.1449 0.1424 0.1190 0.1275 0.2734 0.2450
va: 1.2828 5.5076 1.1215 1.1114 1.1168 2.2278 2.0911 2.0197 1.9320 1.8942 1.9045 3.5029 3.9182 3.9652 3.8314 3.9163 3.8553 3.8426 3.6109 3.7385 3.7489 3.8644 4.0123 3.9426 3.8080 3.8584 3.8928 4.4568 1.0041 1.0069 1.0074 1.0237 1.0058 0.9977 1.0172 1.0125 1.0100 1.0051 1.0151 1.0261 0.9965 1.0041 1.0561 0.9937
dispcorr: -0.026516545 hartree
energy: -2266.926972170586
dipole: 24.28655 -21.40877 2.87779 21.04856 -20.66128 0.38728 11.89205 -11.61974 0.27231
magnitude: 2.91647 au
magnitude: 7.41307 debye
