program: Orca
programVersion: 5.0.2
elementType: Cl S F F F O O O O O O C C C C C C C C C C C C C C C C C H H H H H H H H H H H H H H H H
charge: 0
multiplicity: 1
keywords: wb97x-d3
keywords: def2-TZVPP
keywords: def2/J RIJCOSX
keywords: DEFGRID2
keywords: scfconv7
keywords: smallprint printgap noloewdin
keywords: NOSOSCF
formula: C17H16ClF3O6S
InChI: InChI=1/C17H16ClF3O6S/c1-28(25,26)13-6-5-9(15(18)10(13)7-27-8-17(19,20)21)16(24)14-11(22)3-2-4-12(14)23/h3,5-6,22-23H,2,4,7-8H2,1H3
44 atoms
Cl 1.071815 -0.481416 -1.556804
S  -3.549537 1.878805 0.277988
F  -2.709778 -4.923819 -0.625835
F  -3.306847 -3.436668 0.81485
F  -1.231345 -3.947876 0.6021
O  5.216041 1.909261 -0.621411
O  1.734712 -0.117358 1.794804
O  2.918741 2.828943 -0.795388
O  -1.752845 -1.527732 -0.505981
O  -3.833073 3.066695 1.08225
O  -4.17288 1.797675 -1.042457
C  3.351283 0.827058 0.341953
C  4.98549 -1.494649 0.567396
C  5.655591 -0.128291 0.513002
C  3.677344 -1.40458 1.294714
C  4.70293 0.917065 0.049509
C  2.920971 -0.309919 1.168937
C  2.483462 1.827982 -0.196566
C  0.994496 1.750369 -0.075138
C  -1.155227 0.740509 -0.639363
C  -1.768923 1.76156 0.094888
C  0.238437 0.756768 -0.685453
C  0.342665 2.766061 0.603423
C  -1.035535 2.764784 0.708632
C  -1.89154 -0.380368 -1.32074
C  -3.997145 0.463281 1.245989
C  -2.21274 -2.689332 -1.143956
C  -2.363562 -3.751396 -0.082204
H  5.650954 -2.197328 1.067499
H  4.846021 -1.875936 -0.450834
H  6.537371 -0.133708 -0.12824
H  5.990633 0.162399 1.516261
H  3.35254 -2.227926 1.920829
H  0.913405 3.55478 1.075097
H  -1.521657 3.549183 1.269503
H  -2.945066 -0.152107 -1.483497
H  -1.461441 -0.546456 -2.314574
H  -3.745026 -0.463757 0.737631
H  -5.07532 0.512213 1.400869
H  -3.48408 0.514183 2.204393
H  -3.185775 -2.540247 -1.626987
H  -1.509368 -3.038582 -1.909966
H  4.462524 2.537711 -0.838257
H  1.483156 -0.921627 2.266683
elementType: Cl S F O C H
totalener: -2266.90347636 hartree
nucrepener: 3239.56005690 hartree
electener: -5506.46353326 hartree
oneelecener: -9565.62323006 hartree
twoeener: 4059.15969681 hartree
cpcmener: -0.05296788 hartree
kineticenergy: 2259.89108524 hartree
xcener: -166.575096674261 hartree
chargesum: -0.0000000
charge: -0.058230 0.864193 -0.182565 -0.183093 -0.183228 -0.333222 -0.365588 -0.489269 -0.349365 -0.564026 -0.555247 -0.184471 -0.084938 -0.113301 -0.237149 0.301742 0.131391 0.398768 0.089982 -0.026806 0.022535 -0.054579 -0.135869 -0.115153 -0.080253 -0.234078 -0.003583 0.486748 0.086226 0.074890 0.094253 0.104988 0.129566 0.153200 0.158302 0.135552 0.130649 0.126905 0.141844 0.146469 0.117273 0.124594 0.272229 0.241713
qa: -0.0582 0.8642 -0.1826 -0.1831 -0.1832 -0.3332 -0.3656 -0.4893 -0.3494 -0.5640 -0.5552 -0.1845 -0.0849 -0.1133 -0.2371 0.3017 0.1314 0.3988 0.0900 -0.0268 0.0225 -0.0546 -0.1359 -0.1152 -0.0803 -0.2341 -0.0036 0.4867 0.0862 0.0749 0.0943 0.1050 0.1296 0.1532 0.1583 0.1356 0.1306 0.1269 0.1418 0.1465 0.1173 0.1246 0.2722 0.2417
va: 1.2866 5.5168 1.1202 1.1103 1.1152 2.2232 2.0920 2.0192 1.8984 1.9138 1.8895 3.4403 3.9237 3.9626 3.8269 3.9309 3.8369 3.7575 3.5923 3.7368 3.7280 4.0374 4.0516 3.9467 3.8825 3.8587 3.8780 4.4395 1.0078 1.0046 1.0236 1.0086 1.0049 1.0056 1.0178 1.0195 0.9993 1.0241 1.0139 1.0076 1.0026 1.0064 1.0559 0.9964
dispcorr: -0.025803466 hartree
energy: -2266.929279821139
dipole: 15.60008 -14.05229 1.54779 9.38609 -12.00379 -2.61770 5.72666 -4.90472 0.82194
magnitude: 3.15018 au
magnitude: 8.00711 debye
