program: Orca
programVersion: 5.0.2
elementType: Cl S F F F O O O O O O C C C C C C C C C C C C C C C C C H H H H H H H H H H H H H H H H
charge: 0
multiplicity: 1
keywords: wb97x-d3
keywords: def2-TZVPP
keywords: def2/J RIJCOSX
keywords: DEFGRID2
keywords: scfconv7
keywords: smallprint printgap noloewdin
keywords: NOSOSCF
formula: C17H16ClF3O6S
InChI: InChI=1/C17H16ClF3O6S/c1-28(25,26)13-6-5-9(15(18)10(13)7-27-8-17(19,20)21)16(24)14-11(22)3-2-4-12(14)23/h3,5-6,22-23H,2,4,7-8H2,1H3
44 atoms
Cl 1.481234 -0.334508 -1.75353
S  -3.306606 1.447194 0.400935
F  -3.993439 -2.774508 0.908267
F  -2.236972 -3.950809 0.533282
F  -4.038621 -4.332932 -0.584626
O  5.427598 2.114951 -0.611476
O  2.014762 -0.121479 1.721277
O  3.090211 2.961711 -0.757639
O  -2.051494 -1.417302 -0.534309
O  -3.738713 2.798653 0.75749
O  -4.018338 0.794399 -0.694685
C  3.600048 0.937988 0.3114
C  5.303054 -1.340926 0.430934
C  5.931722 0.046168 0.438815
C  3.993863 -1.324031 1.161637
C  4.94652 1.081646 0.021895
C  3.205277 -0.248081 1.086468
C  2.695674 1.921079 -0.202454
C  1.212084 1.752113 -0.108433
C  -0.852945 0.604491 -0.729027
C  -1.537973 1.523473 0.079041
C  0.532061 0.749063 -0.792005
C  0.491939 2.667558 0.635948
C  -0.881274 2.548148 0.742478
C  -1.554271 -0.493774 -1.48048
C  -3.402346 0.451768 1.865218
C  -2.861016 -2.389776 -1.134193
C  -3.280852 -3.362765 -0.061832
H  5.989905 -2.045383 0.898758
H  5.173935 -1.680009 -0.603586
H  6.811652 0.095774 -0.203041
H  6.260798 0.300468 1.453701
H  3.695739 -2.184216 1.750185
H  1.003069 3.463883 1.160025
H  -1.422039 3.258762 1.350791
H  -2.356775 -0.075704 -2.09066
H  -0.870477 -0.991899 -2.16952
H  -4.458458 0.318801 2.101801
H  -2.90421 0.977313 2.677259
H  -2.927123 -0.508472 1.696639
H  -3.758989 -1.955684 -1.590128
H  -2.326142 -2.942198 -1.916569
H  4.657601 2.728175 -0.802835
H  1.794143 -0.953711 2.158718
elementType: Cl S F O C H
totalener: -2266.90122655 hartree
nucrepener: 3238.12767315 hartree
electener: -5505.02889970 hartree
oneelecener: -9563.12412154 hartree
twoeener: 4058.09522184 hartree
cpcmener: -0.04979351 hartree
kineticenergy: 2259.90862010 hartree
xcener: -166.578459772401 hartree
chargesum: -0.0000000
charge: -0.061278 0.884126 -0.182466 -0.186056 -0.182215 -0.332558 -0.368110 -0.488742 -0.353422 -0.572426 -0.555745 -0.190530 -0.085120 -0.113270 -0.237622 0.302876 0.133224 0.390793 0.083929 -0.034080 -0.007147 0.017396 -0.126235 -0.137663 -0.039121 -0.260452 -0.020338 0.501886 0.086741 0.074573 0.093918 0.104918 0.130034 0.153530 0.149601 0.137095 0.113371 0.143530 0.148051 0.129615 0.115527 0.124726 0.271687 0.243450
qa: -0.0613 0.8841 -0.1825 -0.1861 -0.1822 -0.3326 -0.3681 -0.4887 -0.3534 -0.5724 -0.5557 -0.1905 -0.0851 -0.1133 -0.2376 0.3029 0.1332 0.3908 0.0839 -0.0341 -0.0071 0.0174 -0.1262 -0.1377 -0.0391 -0.2605 -0.0203 0.5019 0.0867 0.0746 0.0939 0.1049 0.1300 0.1535 0.1496 0.1371 0.1134 0.1435 0.1481 0.1296 0.1155 0.1247 0.2717 0.2435
va: 1.2850 5.4905 1.1099 1.1144 1.1221 2.2240 2.0894 2.0173 1.9335 1.9002 1.8956 3.4557 3.9217 3.9628 3.8277 3.9285 3.8337 3.7731 3.6119 3.8083 3.7270 3.9354 4.0446 3.9977 3.9107 3.8634 3.8967 4.4072 1.0079 1.0050 1.0237 1.0087 1.0046 1.0041 1.0189 0.9976 1.0170 1.0097 1.0076 1.0259 1.0084 1.0044 1.0548 0.9946
dispcorr: -0.026383496 hartree
energy: -2266.927610050023
dipole: 21.40151 -19.09669 2.30482 8.75271 -10.82487 -2.07217 7.09988 -5.95613 1.14375
magnitude: 3.30367 au
magnitude: 8.39727 debye
