program: Orca
programVersion: 5.0.2
elementType: Cl S F F F O O O O O O C C C C C C C C C C C C C C C C C H H H H H H H H H H H H H H H H
charge: 0
multiplicity: 1
keywords: wb97x-d3
keywords: def2-TZVPP
keywords: def2/J RIJCOSX
keywords: DEFGRID2
keywords: scfconv7
keywords: smallprint printgap noloewdin
keywords: NOSOSCF
formula: C17H16ClF3O6S
InChI: InChI=1/C17H16ClF3O6S/c1-28(25,26)13-6-5-9(15(18)10(13)7-27-8-17(19,20)21)16(24)14-11(22)3-2-4-12(14)23/h3,5-6,22-23H,2,4,7-8H2,1H3
44 atoms
Cl 1.030245 -1.361563 -1.146466
S  -2.959315 1.381575 1.500241
F  -4.729795 -1.773486 -2.109527
F  -4.009929 -3.156984 -0.629748
F  -4.134207 -3.762445 -2.694704
O  5.294209 1.304039 -1.528785
O  2.508865 -0.248944 1.917947
O  2.831551 1.368693 -1.825401
O  -2.128597 -1.058917 -1.495325
O  -3.267123 0.213785 2.322911
O  -3.01934 2.698634 2.128512
C  3.805887 0.76686 0.220242
C  6.01653 1.034573 2.004344
C  6.285152 0.705171 0.541784
C  4.732049 0.408236 2.459218
C  5.079287 0.94551 -0.29824
C  3.703233 0.300998 1.612107
C  2.694145 1.057161 -0.631765
C  1.296465 1.079206 -0.096445
C  -0.890663 0.035166 0.159249
C  -1.309915 1.19784 0.815439
C  0.420603 0.025512 -0.310096
C  0.846414 2.208069 0.563287
C  -0.459397 2.274594 1.012957
C  -1.775656 -1.147831 -0.126028
C  -4.047717 1.419795 0.098595
C  -2.410008 -2.259875 -2.147519
C  -3.827221 -2.736559 -1.891133
H  5.994647 2.122907 2.138605
H  6.849168 0.672379 2.607494
H  6.538256 -0.357879 0.440205
H  7.129401 1.271861 0.147138
H  4.6451 0.049767 3.478961
H  1.516888 3.040422 0.733062
H  -0.800181 3.167386 1.516613
H  -1.229184 -2.073353 0.085176
H  -2.654671 -1.161444 0.516226
H  -5.048019 1.618662 0.486353
H  -4.050081 0.472268 -0.433839
H  -3.747419 2.225644 -0.569204
H  -2.300538 -2.079947 -3.219735
H  -1.716136 -3.063485 -1.872124
H  4.395903 1.398152 -1.972345
H  2.484284 -0.481803 2.854623
elementType: Cl S F O C H
totalener: -2266.90709321 hartree
nucrepener: 3193.33151122 hartree
electener: -5460.23860443 hartree
oneelecener: -9473.50681026 hartree
twoeener: 4013.26820583 hartree
cpcmener: -0.04330929 hartree
kineticenergy: 2259.90184260 hartree
xcener: -166.572953528406 hartree
chargesum: 0.0000000
charge: -0.063416 0.858088 -0.183203 -0.185596 -0.182458 -0.320624 -0.354765 -0.458071 -0.334511 -0.540130 -0.550473 -0.168341 -0.085953 -0.113311 -0.249275 0.295525 0.147859 0.316891 0.073409 -0.038227 0.008826 0.028646 -0.134980 -0.092427 -0.119647 -0.243017 -0.012027 0.497028 0.075870 0.084962 0.104781 0.094426 0.122705 0.152584 0.157846 0.136756 0.126715 0.140040 0.127719 0.143239 0.130187 0.103797 0.266512 0.236038
qa: -0.0634 0.8581 -0.1832 -0.1856 -0.1825 -0.3206 -0.3548 -0.4581 -0.3345 -0.5401 -0.5505 -0.1683 -0.0860 -0.1133 -0.2493 0.2955 0.1479 0.3169 0.0734 -0.0382 0.0088 0.0286 -0.1350 -0.0924 -0.1196 -0.2430 -0.0120 0.4970 0.0759 0.0850 0.1048 0.0944 0.1227 0.1526 0.1578 0.1368 0.1267 0.1400 0.1277 0.1432 0.1302 0.1038 0.2665 0.2360
va: 1.2817 5.5354 1.1116 1.1060 1.1230 2.2396 2.1069 2.0498 1.9133 1.9094 1.9303 3.4959 3.9213 3.9620 3.8257 3.9227 3.8618 3.8505 3.6511 3.7685 3.7341 3.9836 4.0051 3.9223 3.8889 3.8683 3.9367 4.3621 1.0037 1.0069 1.0080 1.0235 1.0077 0.9985 1.0172 0.9974 1.0310 1.0142 1.0204 1.0081 1.0024 1.0109 1.0638 1.0018
dispcorr: -0.025801327 hartree
energy: -2266.932894541997
dipole: 27.73518 -25.30820 2.42698 16.45298 -16.74359 -0.29061 13.47318 -13.52291 -0.04972
magnitude: 2.44482 au
magnitude: 6.21425 debye
