program: Orca
programVersion: 5.0.2
elementType: Cl S F F F O O O O O O C C C C C C C C C C C C C C C C C H H H H H H H H H H H H H H H H
charge: 0
multiplicity: 1
keywords: wb97x-d3
keywords: def2-TZVPP
keywords: def2/J RIJCOSX
keywords: DEFGRID2
keywords: scfconv7
keywords: smallprint printgap noloewdin
keywords: NOSOSCF
formula: C17H16ClF3O6S
InChI: InChI=1/C17H16ClF3O6S/c1-28(25,26)13-6-5-9(15(18)10(13)7-27-8-17(19,20)21)16(24)14-11(22)3-2-4-12(14)23/h3,5-6,22-23H,2,4,7-8H2,1H3
44 atoms
Cl 1.283916 -0.412021 -2.143499
S  -3.14045 1.300664 0.763965
F  -4.572877 -4.076456 -0.97407
F  -4.448269 -2.573078 0.560621
F  -2.787219 -3.895476 0.223621
O  5.460077 2.023992 -0.936464
O  2.255595 -0.615937 1.270225
O  3.056521 2.344365 -1.445907
O  -2.259978 -1.4205 -0.755595
O  -3.412185 2.601344 1.371778
O  -4.022439 0.87475 -0.316174
C  3.763138 0.90521 0.26317
C  5.758649 0.283809 2.213567
C  6.186989 0.560781 0.779092
C  4.413981 -0.379808 2.244951
C  5.091946 1.203981 0.00191
C  3.48998 -0.071898 1.328811
C  2.767474 1.568435 -0.521263
C  1.306149 1.430635 -0.222744
C  -0.88502 0.500907 -0.762941
C  -1.414794 1.317296 0.24868
C  0.491667 0.583839 -0.965009
C  0.7440 2.233711 0.749201
C  -0.616893 2.176596 0.987644
C  -1.743019 -0.413064 -1.595401
C  -3.149894 0.086256 2.059202
C  -3.18471 -2.237062 -1.413747
C  -3.74747 -3.198174 -0.39465
H  5.749823 1.221475 2.782099
H  6.505874 -0.351609 2.689152
H  6.424497 -0.383373 0.272176
H  7.084338 1.179081 0.734563
H  4.197868 -1.105475 3.021259
H  1.365653 2.902463 1.330228
H  -1.041008 2.807616 1.755757
H  -2.543427 0.162759 -2.067748
H  -1.161306 -0.855577 -2.406924
H  -4.17981 -0.015758 2.403294
H  -2.523049 0.437357 2.876304
H  -2.777722 -0.861886 1.686524
H  -4.011273 -1.662165 -1.850984
H  -2.719839 -2.813947 -2.223674
H  4.624785 2.34789 -1.394013
H  2.130679 -1.22542 2.008064
elementType: Cl S F O C H
totalener: -2266.90654810 hartree
nucrepener: 3209.25194006 hartree
electener: -5476.15848816 hartree
oneelecener: -9505.59841825 hartree
twoeener: 4029.43993009 hartree
cpcmener: -0.04301556 hartree
kineticenergy: 2259.90318524 hartree
xcener: -166.574250106914 hartree
chargesum: -0.0000000
charge: -0.065786 0.873741 -0.181387 -0.182413 -0.186051 -0.319790 -0.352116 -0.458200 -0.343597 -0.555525 -0.543035 -0.163472 -0.082983 -0.114406 -0.251974 0.296098 0.152160 0.315020 0.076279 -0.060319 -0.022219 0.073664 -0.140316 -0.109086 -0.044271 -0.266340 -0.028016 0.506651 0.075264 0.084563 0.105109 0.094190 0.122167 0.151467 0.148422 0.135496 0.108472 0.141667 0.147443 0.126272 0.114769 0.123312 0.265792 0.233280
qa: -0.0658 0.8737 -0.1814 -0.1824 -0.1861 -0.3198 -0.3521 -0.4582 -0.3436 -0.5555 -0.5430 -0.1635 -0.0830 -0.1144 -0.2520 0.2961 0.1522 0.3150 0.0763 -0.0603 -0.0222 0.0737 -0.1403 -0.1091 -0.0443 -0.2663 -0.0280 0.5067 0.0753 0.0846 0.1051 0.0942 0.1222 0.1515 0.1484 0.1355 0.1085 0.1417 0.1474 0.1263 0.1148 0.1233 0.2658 0.2333
va: 1.2769 5.5181 1.1241 1.1107 1.1138 2.2403 2.1100 2.0512 1.9434 1.9210 1.9134 3.4941 3.9200 3.9634 3.8270 3.9245 3.8579 3.8541 3.6728 3.8385 3.7276 3.8852 4.0294 3.9650 3.9234 3.8610 3.9104 4.3952 1.0036 1.0067 1.0078 1.0236 1.0081 0.9990 1.0191 0.9966 1.0180 1.0110 1.0083 1.0268 1.0070 1.0046 1.0647 1.0039
dispcorr: -0.025989271 hartree
energy: -2266.932537369692
dipole: 25.72746 -23.09905 2.62841 12.04058 -13.51598 -1.47540 13.82557 -12.24519 1.58038
magnitude: 3.40337 au
magnitude: 8.65068 debye
