program: Orca
programVersion: 5.0.2
elementType: Cl S F F F O O O O O O C C C C C C C C C C C C C C C C C H H H H H H H H H H H H H H H H
charge: 0
multiplicity: 1
keywords: wb97x-d3
keywords: def2-TZVPP
keywords: def2/J RIJCOSX
keywords: DEFGRID2
keywords: scfconv7
keywords: smallprint printgap noloewdin
keywords: NOSOSCF
formula: C17H16ClF3O6S
InChI: InChI=1/C17H16ClF3O6S/c1-28(25,26)13-6-5-9(15(18)10(13)7-27-8-17(19,20)21)16(24)14-11(22)3-2-4-12(14)23/h3,5-6,22-23H,2,4,7-8H2,1H3
44 atoms
Cl 1.023591 -0.850838 1.733079
S  -3.149238 1.64811 -0.962079
F  -2.357739 -4.125782 0.189397
F  -4.457703 -4.192787 0.696009
F  -3.049669 -3.277997 2.040739
O  5.307847 1.548265 1.471722
O  2.274997 -0.277149 -1.625069
O  2.881325 1.902502 1.793451
O  -2.410089 -1.397204 -0.161536
O  -4.080459 1.08955 0.0136
O  -3.313903 3.059818 -1.305029
C  3.716142 0.854921 -0.127752
C  5.897593 0.581426 -1.95725
C  6.16719 0.483692 -0.462406
C  4.540178 0.035518 -2.284762
C  5.017973 0.999808 0.330249
C  3.529624 0.177732 -1.420401
C  2.664404 1.367127 0.694335
C  1.232772 1.351136 0.254749
C  -1.013007 0.406227 0.424242
C  -1.446688 1.441709 -0.417956
C  0.344965 0.397045 0.737404
C  0.765663 2.355433 -0.568773
C  -0.575321 2.403954 -0.903715
C  -1.939494 -0.657979 0.949566
C  -3.233648 0.722446 -2.475493
C  -3.59316 -2.113404 0.032432
C  -3.356919 -3.431368 0.743475
H  6.668582 0.026896 -2.49224
H  5.992833 1.624762 -2.28162
H  7.078827 1.010515 -0.178156
H  6.302932 -0.567263 -0.177214
H  4.382897 -0.46523 -3.23377
H  1.444619 3.105121 -0.953403
H  -0.925791 3.199225 -1.546002
H  -1.407204 -1.30079 1.648779
H  -2.762125 -0.201385 1.503186
H  -2.541973 1.155692 -3.195852
H  -4.254786 0.807201 -2.849916
H  -2.985598 -0.319603 -2.299113
H  -4.348619 -1.546103 0.586595
H  -4.001909 -2.334579 -0.956299
H  4.436889 1.812782 1.903209
H  2.205754 -0.664796 -2.506415
elementType: Cl S F O C H
totalener: -2266.90575174 hartree
nucrepener: 3201.65674424 hartree
electener: -5468.56249598 hartree
oneelecener: -9490.34668351 hartree
twoeener: 4021.78418754 hartree
cpcmener: -0.04326317 hartree
kineticenergy: 2259.90498956 hartree
xcener: -166.574965444477 hartree
chargesum: 0.0000000
charge: -0.067227 0.876291 -0.183523 -0.184291 -0.186123 -0.319884 -0.353084 -0.457579 -0.356205 -0.542188 -0.556891 -0.162981 -0.082696 -0.114496 -0.253421 0.296129 0.155576 0.318955 0.097128 -0.038041 -0.038972 0.050599 -0.147555 -0.096943 -0.065277 -0.265283 -0.004492 0.496796 0.084389 0.075648 0.093375 0.105251 0.121908 0.151628 0.147687 0.105610 0.144636 0.143348 0.140974 0.138492 0.111489 0.122468 0.265573 0.233199
qa: -0.0672 0.8763 -0.1835 -0.1843 -0.1861 -0.3199 -0.3531 -0.4576 -0.3562 -0.5422 -0.5569 -0.1630 -0.0827 -0.1145 -0.2534 0.2961 0.1556 0.3190 0.0971 -0.0380 -0.0390 0.0506 -0.1476 -0.0969 -0.0653 -0.2653 -0.0045 0.4968 0.0844 0.0756 0.0934 0.1053 0.1219 0.1516 0.1477 0.1056 0.1446 0.1433 0.1410 0.1385 0.1115 0.1225 0.2656 0.2332
va: 1.2749 5.5095 1.1161 1.1196 1.1087 2.2398 2.1087 2.0527 1.9323 1.9106 1.9208 3.4914 3.9208 3.9638 3.8295 3.9247 3.8549 3.8450 3.6481 3.7899 3.7497 3.9174 4.0292 3.9598 3.9445 3.8645 3.8989 4.4067 1.0067 1.0036 1.0239 1.0079 1.0082 0.9992 1.0196 1.0244 0.9948 1.0080 1.0106 1.0127 1.0149 1.0013 1.0660 1.0040
dispcorr: -0.025951335 hartree
energy: -2266.931703077923
dipole: 22.24016 -20.21882 2.02134 17.15875 -17.91409 -0.75534 -20.84616 17.71799 -3.12817
magnitude: 3.80024 au
magnitude: 9.65944 debye
