program: Orca
programVersion: 5.0.2
elementType: Cl S F F F O O O O O O C C C C C C C C C C C C C C C C C H H H H H H H H H H H H H H H H
charge: 0
multiplicity: 1
keywords: wb97x-d3
keywords: def2-TZVPP
keywords: def2/J RIJCOSX
keywords: DEFGRID2
keywords: scfconv7
keywords: smallprint printgap noloewdin
keywords: NOSOSCF
formula: C17H16ClF3O6S
InChI: InChI=1/C17H16ClF3O6S/c1-28(25,26)13-6-5-9(15(18)10(13)7-27-8-17(19,20)21)16(24)14-11(22)3-2-4-12(14)23/h3,5-6,22-23H,2,4,7-8H2,1H3
44 atoms
Cl 1.082591 -0.927884 -1.609467
S  -3.192623 1.712936 0.761707
F  -2.289536 -4.119681 -0.177866
F  -2.913857 -3.337339 -2.082516
F  -4.359205 -4.253552 -0.779581
O  5.360858 1.451764 -1.291248
O  2.176763 -0.212365 1.743345
O  2.955149 1.81365 -1.732608
O  -2.425453 -1.384031 0.102621
O  -3.366351 3.133128 1.059109
O  -4.078532 1.128725 -0.240168
C  3.695591 0.842305 0.266433
C  5.796956 0.602127 2.193601
C  6.125341 0.449038 0.715164
C  4.418212 0.088851 2.483507
C  5.017043 0.950871 -0.14276
C  3.445935 0.215772 1.573992
C  2.686266 1.332498 -0.619823
C  1.23676 1.348398 -0.242526
C  -1.005288 0.407834 -0.472962
C  -1.469649 1.483487 0.300067
C  0.366131 0.374491 -0.716315
C  0.739038 2.396365 0.505439
C  -0.615275 2.464597 0.778745
C  -1.913041 -0.668531 -1.005507
C  -3.349934 0.826961 2.292922
C  -3.579791 -2.133258 -0.134999
C  -3.277592 -3.464627 -0.797041
H  5.896607 1.654144 2.4869
H  6.535825 0.053862 2.778278
H  6.257587 -0.612922 0.471528
H  7.055439 0.953805 0.451075
H  4.214919 -0.37706 3.441488
H  1.404078 3.163165 0.88098
H  -0.991058 3.290335 1.366381
H  -2.714432 -0.224038 -1.598309
H  -1.355666 -1.324449 -1.67175
H  -3.097352 -0.219695 2.153216
H  -4.387389 0.923758 2.616537
H  -2.690997 1.277575 3.033329
H  -4.037645 -2.337773 0.835631
H  -4.315912 -1.59769 -0.745099
H  4.510983 1.709228 -1.768362
H  2.066156 -0.569623 2.632803
elementType: Cl S F O C H
totalener: -2266.90577865 hartree
nucrepener: 3202.96675267 hartree
electener: -5469.87253132 hartree
oneelecener: -9492.98776717 hartree
twoeener: 4023.11523584 hartree
cpcmener: -0.04316429 hartree
kineticenergy: 2259.90479118 hartree
xcener: -166.574804108784 hartree
chargesum: 0.0000000
charge: -0.067616 0.875153 -0.183668 -0.185930 -0.183945 -0.321038 -0.352296 -0.457173 -0.354534 -0.556053 -0.542188 -0.165197 -0.082523 -0.115483 -0.253423 0.296120 0.156732 0.321886 0.094640 -0.040575 -0.036234 0.049536 -0.144424 -0.097445 -0.068901 -0.266222 -0.003837 0.496574 0.075614 0.084490 0.105433 0.093584 0.121832 0.151823 0.148270 0.145404 0.105772 0.139559 0.140872 0.142899 0.122464 0.111205 0.266188 0.232654
qa: -0.0676 0.8752 -0.1837 -0.1859 -0.1839 -0.3210 -0.3523 -0.4572 -0.3545 -0.5561 -0.5422 -0.1652 -0.0825 -0.1155 -0.2534 0.2961 0.1567 0.3219 0.0946 -0.0406 -0.0362 0.0495 -0.1444 -0.0974 -0.0689 -0.2662 -0.0038 0.4966 0.0756 0.0845 0.1054 0.0936 0.1218 0.1518 0.1483 0.1454 0.1058 0.1396 0.1409 0.1429 0.1225 0.1112 0.2662 0.2327
va: 1.2743 5.5120 1.1160 1.1088 1.1199 2.2389 2.1095 2.0535 1.9343 1.9224 1.9105 3.4932 3.9203 3.9647 3.8297 3.9249 3.8542 3.8434 3.6543 3.7934 3.7512 3.9185 4.0267 3.9582 3.9457 3.8640 3.9002 4.4036 1.0035 1.0066 1.0077 1.0238 1.0082 0.9993 1.0196 0.9950 1.0238 1.0127 1.0108 1.0084 1.0014 1.0142 1.0657 1.0045
dispcorr: -0.025929985 hartree
energy: -2266.931708638818
dipole: 21.00281 -19.15376 1.84905 17.77538 -18.44205 -0.66667 21.11195 -17.89354 3.21840
magnitude: 3.77115 au
magnitude: 9.58549 debye
