program: Orca
programVersion: 5.0.2
elementType: Cl S F F F O O O O O O C C C C C C C C C C C C C C C C C H H H H H H H H H H H H H H H H
charge: 0
multiplicity: 1
keywords: wb97x-d3
keywords: def2-TZVPP
keywords: def2/J RIJCOSX
keywords: DEFGRID2
keywords: scfconv7
keywords: smallprint printgap noloewdin
keywords: NOSOSCF
formula: C17H16ClF3O6S
InChI: InChI=1/C17H16ClF3O6S/c1-28(25,26)13-6-5-9(15(18)10(13)7-27-8-17(19,20)21)16(24)14-11(22)3-2-4-12(14)23/h3,5-6,22-23H,2,4,7-8H2,1H3
44 atoms
Cl 0.691675 0.095705 2.28955
S  -3.608987 1.460401 -0.904593
F  -1.663293 -1.748844 -0.975621
F  -2.51572 -3.706191 -0.691829
F  -0.661272 -3.177842 0.278222
O  5.001667 1.747362 0.806247
O  1.661474 -1.196719 -0.744262
O  2.667211 2.514083 0.677821
O  -1.944488 -1.313016 1.900682
O  -3.715211 1.992536 -2.25939
O  -4.31023 0.212526 -0.610147
C  3.286914 0.385438 -0.07443
C  5.383718 -1.327795 -1.055818
C  5.642925 -0.435046 0.149115
C  3.94292 -1.733141 -1.125171
C  4.60686 0.625596 0.284514
C  2.979707 -0.920377 -0.676488
C  2.334095 1.41583 0.198589
C  0.870192 1.27854 -0.092349
C  -1.384178 0.705276 0.653547
C  -1.861605 1.301504 -0.520693
C  -0.003249 0.734343 0.839076
C  0.360362 1.831517 -1.251658
C  -1.00538 1.850433 -1.46409
C  -2.243881 0.054896 1.718561
C  -4.172702 2.717688 0.217642
C  -2.657772 -2.241888 1.135624
C  -1.86756 -2.711441 -0.06861
H  6.022689 -2.2082 -0.983843
H  5.68682 -0.808626 -1.972787
H  6.634833 0.016458 0.112308
H  5.597389 -1.031444 1.069149
H  3.684631 -2.681073 -1.584533
H  1.026226 2.259353 -1.989753
H  -1.390958 2.301472 -2.366808
H  -2.042388 0.545323 2.672532
H  -3.306459 0.185269 1.524881
H  -5.234838 2.872821 0.023271
H  -3.624609 3.6393 0.030482
H  -4.032283 2.402843 1.249762
H  -2.844652 -3.115844 1.764985
H  -3.628572 -1.867876 0.798101
H  4.186048 2.339473 0.880158
H  1.52727 -2.029511 -1.21272
elementType: Cl S F O C H
totalener: -2266.90302280 hartree
nucrepener: 3344.74159827 hartree
electener: -5611.64462107 hartree
oneelecener: -9777.63195108 hartree
twoeener: 4165.98733001 hartree
cpcmener: -0.04411148 hartree
kineticenergy: 2259.90364996 hartree
xcener: -166.575743996951 hartree
chargesum: -0.0000000
charge: -0.061324 0.856014 -0.181552 -0.185242 -0.191087 -0.322720 -0.347105 -0.461869 -0.345759 -0.549323 -0.541914 -0.192924 -0.078984 -0.113156 -0.255128 0.295147 0.179368 0.337887 0.091348 -0.123099 0.049414 -0.004779 -0.136831 -0.098058 -0.034953 -0.250359 -0.001672 0.490220 0.083798 0.074732 0.093620 0.105523 0.119502 0.150593 0.153233 0.140650 0.100668 0.139769 0.141633 0.138944 0.135345 0.106337 0.265815 0.228280
qa: -0.0613 0.8560 -0.1816 -0.1852 -0.1911 -0.3227 -0.3471 -0.4619 -0.3458 -0.5493 -0.5419 -0.1929 -0.0790 -0.1132 -0.2551 0.2951 0.1794 0.3379 0.0913 -0.1231 0.0494 -0.0048 -0.1368 -0.0981 -0.0350 -0.2504 -0.0017 0.4902 0.0838 0.0747 0.0936 0.1055 0.1195 0.1506 0.1532 0.1407 0.1007 0.1398 0.1416 0.1389 0.1353 0.1063 0.2658 0.2283
va: 1.2853 5.5316 1.1007 1.1187 1.1121 2.2363 2.1213 2.0514 1.9593 1.9331 1.8963 3.5052 3.9156 3.9653 3.8347 3.9384 3.8397 3.8320 3.6723 3.7194 3.5446 3.9591 4.0321 3.9556 3.9259 3.8747 3.9037 4.3591 1.0059 1.0026 1.0234 1.0069 1.0088 1.0017 1.0195 0.9899 1.0323 1.0133 1.0064 1.0030 1.0027 1.0169 1.0678 1.0089
dispcorr: -0.027911798 hartree
energy: -2266.930934601643
dipole: 11.75818 -11.01989 0.73830 10.66179 -10.47206 0.18974 -1.96056 2.75355 0.79299
magnitude: 1.09996 au
magnitude: 2.79589 debye
