program: Orca
programVersion: 5.0.2
elementType: Cl S F F F O O O O O O C C C C C C C C C C C C C C C C C H H H H H H H H H H H H H H H H
charge: 0
multiplicity: 1
keywords: wb97x-d3
keywords: def2-TZVPP
keywords: def2/J RIJCOSX
keywords: DEFGRID2
keywords: scfconv7
keywords: smallprint printgap noloewdin
keywords: NOSOSCF
formula: C17H16ClF3O6S
InChI: InChI=1/C17H16ClF3O6S/c1-28(25,26)13-6-5-9(15(18)10(13)7-27-8-17(19,20)21)16(24)14-11(22)3-2-4-12(14)23/h3,5-6,22-23H,2,4,7-8H2,1H3
44 atoms
Cl 0.811337 -0.754043 -1.193773
S  -3.706209 2.08742 0.176813
F  -2.157244 -4.914063 -0.846605
F  -0.558761 -3.812382 0.097164
F  -1.121829 -3.365876 -1.931448
O  5.073914 1.707262 -0.415001
O  1.480021 -0.231083 1.877521
O  2.829481 2.656299 -0.682711
O  -2.07114 -1.472004 0.086232
O  -3.924139 3.436916 0.669732
O  -4.34432 1.658108 -1.057924
C  3.158951 0.660635 0.482419
C  4.742373 -1.678793 0.787336
C  5.439429 -0.324595 0.752038
C  3.416661 -1.55812 1.477659
C  4.520032 0.734304 0.240408
C  2.684015 -0.453518 1.310011
C  2.332039 1.679839 -0.101136
C  0.837275 1.667796 -0.037884
C  -1.352919 0.685997 -0.48339
C  -1.92886 1.842388 0.051668
C  0.040929 0.629422 -0.508772
C  0.221037 2.811201 0.444035
C  -1.155642 2.899154 0.503356
C  -2.138089 -0.507691 -0.95551
C  -4.16666 0.959748 1.486126
C  -2.629917 -2.713599 -0.209622
C  -1.59871 -3.702109 -0.729291
H  5.379501 -2.396719 1.30378
H  4.620869 -2.056349 -0.235116
H  6.344573 -0.343093 0.143944
H  5.73978 -0.037423 1.766938
H  3.064541 -2.373588 2.098523
H  0.827074 3.639455 0.784237
H  -1.625421 3.790399 0.893041
H  -3.174184 -0.248263 -1.17381
H  -1.702961 -0.881182 -1.885557
H  -5.249227 1.020227 1.592473
H  -3.686147 1.275272 2.409269
H  -3.868313 -0.055994 1.240875
H  -3.043928 -3.124658 0.715214
H  -3.451793 -2.651989 -0.93444
H  4.325593 2.342712 -0.659125
H  1.141448 -1.051578 2.246782
totalener: -2266.87413338 hartree
nucrepener: 3280.92624726 hartree
electener: -5547.80038065 hartree
oneelecener: -9648.10870467 hartree
twoeener: 4100.30832402 hartree
kineticenergy: 2260.00038395 hartree
xcener: -166.585903957087 hartree
chargesum: -0.0000000
charge: -0.046521 0.831845 -0.174267 -0.170997 -0.171202 -0.287242 -0.302302 -0.396736 -0.307038 -0.477100 -0.474945 -0.169561 -0.108349 -0.119601 -0.157394 0.256741 0.111542 0.335052 0.111276 0.011120 -0.054306 -0.040528 -0.101217 -0.105312 -0.136582 -0.279660 -0.043277 0.498400 0.076124 0.075251 0.093848 0.089901 0.074099 0.126014 0.150028 0.142687 0.128533 0.131766 0.129199 0.116684 0.111256 0.093397 0.241493 0.187880
qa: -0.0465 0.8318 -0.1743 -0.1710 -0.1712 -0.2872 -0.3023 -0.3967 -0.3070 -0.4771 -0.4749 -0.1696 -0.1083 -0.1196 -0.1574 0.2567 0.1115 0.3351 0.1113 0.0111 -0.0543 -0.0405 -0.1012 -0.1053 -0.1366 -0.2797 -0.0433 0.4984 0.0761 0.0753 0.0938 0.0899 0.0741 0.1260 0.1500 0.1427 0.1285 0.1318 0.1292 0.1167 0.1113 0.0934 0.2415 0.1879
va: 1.3064 5.5821 1.1330 1.1342 1.1253 2.2745 2.1540 2.1260 1.9309 2.0143 1.9820 3.4123 3.9552 3.9506 3.8150 3.9729 3.9282 3.8324 3.5640 3.6489 3.8741 4.0436 4.0508 3.9568 3.9020 3.8821 3.9588 4.4111 1.0084 1.0052 1.0247 1.0131 1.0203 1.0189 1.0254 1.0294 1.0033 1.0157 1.0149 1.0199 1.0059 1.0068 1.1009 1.0430
dispcorr: -0.026378518 hartree
energy: -2266.900511899299
dipole: 8.43337 -7.98411 0.44926 9.93371 -11.52096 -1.58725 14.14019 -12.59453 1.54566
magnitude: 2.26059 au
magnitude: 5.74596 debye
