program: Orca
programVersion: 5.0.2
elementType: Cl S F F F O O O O O O C C C C C C C C C C C C C C C C C H H H H H H H H H H H H H H H H
charge: 0
multiplicity: 1
keywords: wb97x-d3
keywords: def2-TZVPP
keywords: def2/J RIJCOSX
keywords: DEFGRID2
keywords: scfconv7
keywords: smallprint printgap noloewdin
keywords: NOSOSCF
formula: C17H16ClF3O6S
InChI: InChI=1/C17H16ClF3O6S/c1-28(25,26)13-6-5-9(15(18)10(13)7-27-8-17(19,20)21)16(24)14-11(22)3-2-4-12(14)23/h3,5-6,22-23H,2,4,7-8H2,1H3
44 atoms
Cl 1.125161 -0.474252 -1.578922
S  -3.563087 1.785244 0.254218
F  -3.044558 -4.809499 -0.544294
F  -3.409992 -3.23984 0.889036
F  -1.412285 -3.992603 0.606359
O  5.2295 1.995763 -0.464719
O  1.690511 -0.246337 1.638786
O  2.941457 2.884306 -0.664684
O  -1.80854 -1.513701 -0.537575
O  -3.868454 3.01999 0.956556
O  -4.237984 1.483865 -0.998738
C  3.353281 0.820691 0.35191
C  5.037771 -1.469731 0.528033
C  5.670741 -0.085421 0.581809
C  3.693788 -1.452267 1.192562
C  4.710452 0.962679 0.125741
C  2.914815 -0.371691 1.086252
C  2.48762 1.848728 -0.158032
C  0.995028 1.757708 -0.097867
C  -1.130138 0.726645 -0.706677
C  -1.77621 1.732427 0.019714
C  0.263396 0.757299 -0.726067
C  0.312202 2.773743 0.549177
C  -1.067355 2.753782 0.631535
C  -1.847547 -0.395573 -1.40213
C  -3.848597 0.439064 1.391466
C  -2.323367 -2.665447 -1.124544
C  -2.54381 -3.683428 -0.028303
H  5.698004 -2.184176 1.020046
H  4.956374 -1.797283 -0.515474
H  6.582478 -0.027288 -0.013876
H  5.947632 0.153591 1.615806
H  3.365991 -2.32386 1.74723
H  0.867448 3.578542 1.011262
H  -1.589893 3.53387 1.16592
H  -2.876057 -0.126455 -1.64422
H  -1.343712 -0.617635 -2.349414
H  -4.923797 0.401114 1.563776
H  -3.333249 0.647081 2.325995
H  -3.502592 -0.501833 0.974231
H  -3.285547 -2.486987 -1.624294
H  -1.638925 -3.08844 -1.872936
H  4.463381 2.618724 -0.671416
H  1.398071 -1.098036 1.975485
totalener: -2266.87697062 hartree
nucrepener: 3245.57183239 hartree
electener: -5512.44880301 hartree
oneelecener: -9577.08515913 hartree
twoeener: 4064.63635612 hartree
kineticenergy: 2260.00613771 hartree
xcener: -166.586872357913 hartree
chargesum: 0.0000000
charge: -0.057166 0.831201 -0.169688 -0.171992 -0.168172 -0.285349 -0.301349 -0.393243 -0.301932 -0.476710 -0.479960 -0.178505 -0.107305 -0.120715 -0.163233 0.255962 0.125380 0.322772 0.127420 -0.024574 -0.047826 -0.027765 -0.101344 -0.107004 -0.117103 -0.269881 -0.028604 0.482824 0.077136 0.073626 0.094366 0.090582 0.075189 0.126205 0.150663 0.157839 0.108495 0.129142 0.124541 0.118482 0.095212 0.104465 0.240641 0.187275
qa: -0.0572 0.8312 -0.1697 -0.1720 -0.1682 -0.2853 -0.3013 -0.3932 -0.3019 -0.4767 -0.4800 -0.1785 -0.1073 -0.1207 -0.1632 0.2560 0.1254 0.3228 0.1274 -0.0246 -0.0478 -0.0278 -0.1013 -0.1070 -0.1171 -0.2699 -0.0286 0.4828 0.0771 0.0736 0.0944 0.0906 0.0752 0.1262 0.1507 0.1578 0.1085 0.1291 0.1245 0.1185 0.0952 0.1045 0.2406 0.1873
va: 1.2864 5.5784 1.1373 1.1244 1.1378 2.2769 2.1542 2.1279 1.9405 2.0151 1.9764 3.4239 3.9536 3.9538 3.8139 3.9737 3.9149 3.8437 3.5901 3.7305 3.8683 4.0335 4.0524 3.9612 3.8893 3.8735 3.9349 4.4511 1.0080 1.0049 1.0244 1.0126 1.0202 1.0162 1.0247 1.0193 1.0042 1.0176 1.0158 1.0328 1.0031 1.0087 1.0997 1.0437
dispcorr: -0.025946684 hartree
energy: -2266.902917303451
dipole: 16.86399 -15.57263 1.29136 9.14544 -10.70965 -1.56422 5.63521 -5.09487 0.54035
magnitude: 2.09913 au
magnitude: 5.33558 debye
