program: Orca
programVersion: 5.0.2
elementType: Cl S F F F O O O O O O C C C C C C C C C C C C C C C C C H H H H H H H H H H H H H H H H
charge: 0
multiplicity: 1
keywords: wb97x-d3
keywords: def2-TZVPP
keywords: def2/J RIJCOSX
keywords: DEFGRID2
keywords: scfconv7
keywords: smallprint printgap noloewdin
keywords: NOSOSCF
formula: C17H16ClF3O6S
InChI: InChI=1/C17H16ClF3O6S/c1-28(25,26)13-6-5-9(15(18)10(13)7-27-8-17(19,20)21)16(24)14-11(22)3-2-4-12(14)23/h3,5-6,22-23H,2,4,7-8H2,1H3
44 atoms
Cl 1.081818 -0.50927 -1.603012
S  -3.493991 1.843023 0.377353
F  -3.291314 -3.312407 0.895887
F  -1.342864 -4.056926 0.361821
F  -3.093777 -4.770306 -0.680333
O  5.275908 1.834467 -0.617214
O  1.689965 -0.147635 1.661498
O  3.011067 2.782308 -0.853828
O  -1.832892 -1.484481 -0.553614
O  -3.756482 3.077358 1.09705
O  -4.245473 1.540142 -0.830988
C  3.372956 0.775808 0.290938
C  4.986766 -1.551446 0.616479
C  5.663717 -0.187923 0.558186
C  3.651728 -1.441746 1.289687
C  4.730916 0.857725 0.042649
C  2.904824 -0.348521 1.109647
C  2.534191 1.798837 -0.271973
C  1.041363 1.757066 -0.173354
C  -1.121529 0.758567 -0.694275
C  -1.7232 1.784304 0.042395
C  0.270654 0.760172 -0.757429
C  0.400778 2.801774 0.470182
C  -0.975114 2.805488 0.606372
C  -1.883803 -0.339324 -1.380131
C  -3.707503 0.499436 1.533981
C  -2.399439 -2.5976 -1.167306
C  -2.526369 -3.690991 -0.131731
H  5.630286 -2.24648 1.15615
H  4.882979 -1.955384 -0.39766
H  6.565816 -0.204599 -0.054505
H  5.96795 0.1167 1.566947
H  3.302319 -2.259612 1.909239
H  0.986563 3.605879 0.89443
H  -1.463794 3.603057 1.147063
H  -2.915937 -0.046843 -1.575604
H  -1.420335 -0.543269 -2.352554
H  -3.398717 -0.445263 1.095151
H  -4.767646 0.47044 1.783693
H  -3.124895 0.706777 2.428477
H  -3.400984 -2.387807 -1.568447
H  -1.784401 -2.967138 -1.999565
H  4.52863 2.466202 -0.85935
H  1.380619 -0.963114 2.066082
totalener: -2266.87698412 hartree
nucrepener: 3244.27638521 hartree
electener: -5511.15336933 hartree
oneelecener: -9574.49365708 hartree
twoeener: 4063.34028775 hartree
kineticenergy: 2260.00514939 hartree
xcener: -166.586240963389 hartree
chargesum: -0.0000000
charge: -0.055148 0.831833 -0.171391 -0.167144 -0.170592 -0.285224 -0.303251 -0.391454 -0.302319 -0.476653 -0.479805 -0.186243 -0.105938 -0.121656 -0.164879 0.254982 0.139187 0.314537 0.131766 -0.029112 -0.045594 -0.025848 -0.101380 -0.105845 -0.121029 -0.273265 -0.026359 0.480916 0.076593 0.074027 0.094404 0.090752 0.074659 0.126535 0.150904 0.158631 0.109472 0.120634 0.129432 0.124833 0.095887 0.103200 0.240479 0.186467
qa: -0.0551 0.8318 -0.1714 -0.1671 -0.1706 -0.2852 -0.3033 -0.3915 -0.3023 -0.4767 -0.4798 -0.1862 -0.1059 -0.1217 -0.1649 0.2550 0.1392 0.3145 0.1318 -0.0291 -0.0456 -0.0258 -0.1014 -0.1058 -0.1210 -0.2733 -0.0264 0.4809 0.0766 0.0740 0.0944 0.0908 0.0747 0.1265 0.1509 0.1586 0.1095 0.1206 0.1294 0.1248 0.0959 0.1032 0.2405 0.1865
va: 1.2887 5.5767 1.1263 1.1395 1.1360 2.2772 2.1519 2.1290 1.9398 2.0159 1.9759 3.4374 3.9531 3.9565 3.8173 3.9738 3.9020 3.8525 3.5948 3.7243 3.8572 4.0390 4.0513 3.9612 3.8933 3.8736 3.9276 4.4602 1.0079 1.0046 1.0243 1.0124 1.0203 1.0148 1.0240 1.0191 1.0021 1.0323 1.0177 1.0151 1.0036 1.0094 1.0994 1.0443
dispcorr: -0.025912066 hartree
energy: -2266.902896188157
dipole: 16.70611 -15.43237 1.27374 9.56807 -11.02995 -1.46188 6.67395 -6.07370 0.60025
magnitude: 2.02973 au
magnitude: 5.15916 debye
