program: Orca
programVersion: 5.0.2
elementType: Cl S F F F O O O O O O C C C C C C C C C C C C C C C C C H H H H H H H H H H H H H H H H
charge: 0
multiplicity: 1
keywords: wb97x-d3
keywords: def2-TZVPP
keywords: def2/J RIJCOSX
keywords: DEFGRID2
keywords: scfconv7
keywords: smallprint printgap noloewdin
keywords: NOSOSCF
formula: C17H16ClF3O6S
InChI: InChI=1/C17H16ClF3O6S/c1-28(25,26)13-6-5-9(15(18)10(13)7-27-8-17(19,20)21)16(24)14-11(22)3-2-4-12(14)23/h3,5-6,22-23H,2,4,7-8H2,1H3
44 atoms
Cl 1.080578 0.081647 -2.017145
S  -3.68636 1.390793 0.445091
F  -1.51808 -1.614518 0.999842
F  -0.370628 -3.081685 -0.069414
F  -2.295648 -3.607769 0.752162
O  5.110122 1.720715 -0.090357
O  1.520641 -0.870624 1.41462
O  2.832045 2.72102 0.064745
O  -1.549809 -1.380535 -1.937081
O  -4.230765 0.096775 0.058379
O  -4.001069 1.938298 1.752792
C  3.197284 0.433521 0.40903
C  4.731864 -1.874183 -0.197555
C  5.456637 -0.607207 0.243042
C  3.419719 -1.999132 0.517945
C  4.549806 0.5775 0.179588
C  2.707301 -0.899394 0.777751
C  2.362067 1.590382 0.238172
C  0.867978 1.482344 0.250244
C  -1.224034 0.738094 -0.766665
C  -1.89809 1.384613 0.274499
C  0.16929 0.81414 -0.746345
C  0.160116 2.130113 1.246598
C  -1.219168 2.074586 1.26869
C  -1.88589 -0.01482 -1.902636
C  -4.202524 2.597447 -0.771939
C  -2.308908 -2.256217 -1.158719
C  -1.6165 -2.630992 0.139386
H  5.363749 -2.73786 0.010246
H  4.585999 -1.856209 -1.28454
H  6.347895 -0.416106 -0.355793
H  5.785196 -0.714023 1.28395
H  3.059496 -2.979863 0.805267
H  0.691751 2.665453 2.021206
H  -1.765487 2.558664 2.06507
H  -2.96755 0.112711 -1.894064
H  -1.522141 0.401748 -2.844172
H  -3.750894 3.559354 -0.54073
H  -5.287592 2.673212 -0.705095
H  -3.919016 2.280431 -1.773011
H  -3.302159 -1.867846 -0.918946
H  -2.439191 -3.177773 -1.732398
H  4.380946 2.409021 -0.06603
H  1.162234 -1.759632 1.485007
totalener: -2266.87284920 hartree
nucrepener: 3387.98619977 hartree
electener: -5654.85904897 hartree
oneelecener: -9862.81734729 hartree
twoeener: 4207.95829832 hartree
kineticenergy: 2259.99998464 hartree
xcener: -166.586438243070 hartree
chargesum: -0.0000000
charge: -0.037770 0.845489 -0.171822 -0.188435 -0.171274 -0.285819 -0.312127 -0.394413 -0.298816 -0.493012 -0.475952 -0.187623 -0.105025 -0.122511 -0.161363 0.256600 0.151693 0.284167 0.122265 -0.133046 0.036979 -0.025664 -0.066036 -0.124057 -0.049318 -0.284078 -0.034965 0.489664 0.076025 0.073479 0.092611 0.090509 0.077048 0.123633 0.144717 0.085634 0.128023 0.131272 0.133831 0.115554 0.113362 0.117806 0.238897 0.193867
qa: -0.0378 0.8455 -0.1718 -0.1884 -0.1713 -0.2858 -0.3121 -0.3944 -0.2988 -0.4930 -0.4760 -0.1876 -0.1050 -0.1225 -0.1614 0.2566 0.1517 0.2842 0.1223 -0.1330 0.0370 -0.0257 -0.0660 -0.1241 -0.0493 -0.2841 -0.0350 0.4897 0.0760 0.0735 0.0926 0.0905 0.0770 0.1236 0.1447 0.0856 0.1280 0.1313 0.1338 0.1156 0.1134 0.1178 0.2389 0.1939
va: 1.3120 5.5673 1.1176 1.1130 1.1385 2.2765 2.1531 2.1234 1.9991 1.9468 2.0189 3.4547 3.9417 3.9570 3.8252 3.9658 3.8984 3.8913 3.6194 3.6814 3.6217 4.0463 4.0132 4.0079 3.9516 3.9046 3.9317 4.3512 1.0081 1.0054 1.0243 1.0130 1.0201 1.0123 1.0271 1.0346 0.9903 1.0097 1.0160 1.0069 1.0172 1.0052 1.0963 1.0543
dispcorr: -0.029088991 hartree
energy: -2266.901938193637
dipole: 8.52110 -8.29545 0.22565 8.66134 -8.61453 0.04680 -2.77817 1.77297 -1.00520
magnitude: 1.03128 au
magnitude: 2.62131 debye
